program: Gaussian 09
title: 000297819
version: EM64L-G09RevD.01
frameworkgroup: C1[X(C13H17N3O4)]
method: RPBEPBE
basis: SDD
operation: Freq
keyword: #p
keyword: freq=noraman
keyword: PBEPBE/SDD
title: #p freq=noraman PBEPBE/SDD
converged: YES YES NO NO
title: Mulliken charges:
elementType: O O O O N N N C C C C C C C C C C C C C H H H H H H H H H H H H H H H H H
charge: -0.274552 -0.282167 -0.268690 -0.347848 -0.128632 -0.335724 -0.618741 -0.466133 -0.492354 0.244780 -0.616108 0.468618 -0.475455 0.183500 0.361744 -0.365579 -0.381107 -0.226576 -0.224780 -0.230938 0.242581 0.254085 0.255040 0.250241 0.247315 0.227520 0.278448 0.227309 0.242704 0.340735 0.260408 0.234789 0.229659 0.229276 0.231669 0.399921 0.325039
chargesum: 0.00000
title: Mulliken charges with hydrogens summed into heavy atoms:
elementType: O O O O N N N C C C C C C C C C C C C C
charge: -0.274552 -0.282167 -0.268690 -0.347848 -0.128632 0.005012 0.106219 0.030533 0.012927 0.244780 0.137175 0.468618 -0.005442 0.183500 0.361744 -0.105171 -0.146317 0.003082 0.004497 0.000731
polarizability: 2.16778546e+02 -1.15882435e+01 1.78638227e+02 8.44029704e+00 6.14507291e+00 1.17480976e+02
1716.lowfreq: -4.7992 0.0002 0.0004 0.0007 3.6314 7.0918 14.2227 21.2131 29.6269
frequency: 12.8923 20.9031 29.4803 44.8995 54.4361 67.0126 76.7083 97.5496 107.3501 134.9272 153.9191 157.7165 195.5783 227.1458 271.5122 289.6008 308.0698 331.0605 372.7880 376.6657 400.3778 403.8464 438.3240 465.7124 487.3665 529.2744 535.3766 547.1952 573.7734 601.6852 617.6202 648.3483 663.8535 694.8770 703.7305 715.1040 759.3062 803.2808 815.4686 817.3887 836.6908 843.0350 857.4494 913.1873 928.3111 936.8904 964.7835 974.7372 981.7852 990.7326 1001.1266 1017.7678 1027.6215 1081.6297 1091.5103 1097.4208 1124.6737 1136.1554 1174.4065 1189.5429 1193.5142 1222.7695 1227.5959 1237.8863 1239.3745 1269.4184 1313.3357 1329.3072 1331.7711 1352.2735 1360.8944 1386.0210 1400.4363 1417.9143 1442.6228 1446.2554 1462.9718 1472.1480 1481.8079 1485.3580 1487.9581 1494.2797 1594.8853 1596.7624 1613.1063 1615.2010 1628.9927 1665.9445 2983.0976 3024.0074 3033.2398 3042.4014 3064.6029 3085.3538 3101.8655 3116.9865 3121.8742 3128.0238 3129.2858 3141.1987 3152.1670 3166.1163 3326.3813 3584.7137 3598.7405
redmass: 5.0422 5.1567 4.1869 5.5914 5.1482 8.6204 5.0166 5.9920 7.1663 1.0893 5.8786 3.3325 4.4425 4.0605 3.9720 4.2722 4.7099 3.6272 2.8486 3.2982 4.3451 2.8129 2.1385 3.6463 2.4451 4.0847 1.6167 2.8428 2.7293 3.8160 6.2025 4.3970 1.8240 3.7436 1.7809 5.8019 2.1532 3.0996 2.3503 1.6585 3.9772 3.9476 1.2480 3.7299 2.9533 1.6209 2.1984 1.8243 1.4158 5.5226 1.3357 2.4694 2.2159 1.7071 1.5376 2.0507 1.3233 3.7188 1.0541 1.1599 1.7992 2.8853 1.7620 2.0654 1.2706 1.4751 1.3524 1.3828 1.2582 1.2715 3.1108 8.0808 2.0854 1.2910 2.1735 1.1252 1.1423 1.0992 1.2116 2.2082 1.0590 1.8370 6.0876 6.3680 2.9783 6.0200 5.8243 1.6786 1.0352 1.0605 1.0606 1.0587 1.1019 1.1031 1.1013 1.1071 1.0870 1.0987 1.0874 1.0920 1.0964 1.1016 1.0646 1.0782 1.0893
irintensity: 1.6252 0.4861 0.0174 0.6631 0.8776 4.4469 0.7416 6.9330 13.0937 0.1859 0.7360 0.7372 6.8239 4.9164 11.4413 5.5505 6.6049 9.8857 42.8387 4.1386 8.9216 0.0852 1.9511 18.1625 10.4313 5.4873 84.5227 40.3183 17.3586 6.1693 0.3867 12.1515 49.3734 5.9951 53.6543 43.3321 60.8625 26.5653 43.5786 158.2990 9.8504 3.2450 0.8592 129.1548 8.8106 9.0442 1.2653 7.5729 0.4581 0.3840 0.2327 67.1168 3.0800 3.5613 2.1465 37.7644 1.2645 65.8842 0.0269 35.2093 197.6403 34.7735 112.3044 6.3340 17.7330 121.2572 12.5380 13.2356 4.0790 11.1557 54.7575 0.7314 40.2798 73.8687 9.6214 7.4698 13.7344 3.0871 4.4626 8.8304 9.6632 419.7984 3.3461 258.6652 179.0338 0.4531 176.2471 342.6965 44.1219 10.3168 26.0114 29.4111 26.6981 11.2532 12.3697 4.6481 5.2169 1.2185 1.2723 16.1685 29.7349 19.6060 580.3616 62.4846 62.4684
temp: 298.150 k
press: 1.00000 atm
elementType: 8 8 8 8 7 7 7 6 6 6 6 6 6 6 6 6 6 6 6 6 1 1 1 1 1 1 1 1 1 1 1 1 1 1 1 1 1
symmnumber: 1
zpe: 773340.6 jmol-1
zpe.correction: 0.294550 hartree
zpe.thermalcorrener: 0.314514 hartree
zpe.thermalcorrenthalpy: 0.315458 hartree
zpe.thermalcorrgfe: 0.242237 hartree
zpe.sumelectzpe: -969.277007 hartree
zpe.sumelectthermal: -969.257043 hartree
zpe.sumelectthermalent: -969.256099 hartree
zpe.sumelectthermalfe: -969.329320 hartree
dipole: 3.3894 -1.6334 1.6919
dipole: 4.1254
quadrupole: -112.5877 -131.4013 -110.7869
quadrupole: 10.8311 -3.3586 -3.8043
quadrupole: 5.6709 -13.1427 7.4718 10.8311 -3.3586 -3.8043
hfenergy: -969.5715573 hartree
pointgroup: C01 [X(C13H17N3O4)]
dipole: -1.3868828 -0.5854043 -0.6067574 debye
polarizability: 217.9238856|10.2063465|178.6566236|2.4081535|-4.1390161|116.3172395 unknown
InChI: InChI=1S/C13H17N3O4/c1-16(8-11(14)17)12(18)7-15-13(19)20-9-10-5-3-2-4-6-10/h2-6,15H,7-9,14H2,1H3
charge 0 multiplicity 1
37 atoms
O  -1.290708 -1.747828 0.146958
O  2.827757 -2.641282 -0.126935
O  4.384439 2.982916 -0.245512
O  0.264034 0.014735 0.309936
N  3.868356 -0.582039 -0.467074
N  0.469259 -1.671942 -1.293748
N  2.464384 1.858436 0.449201
C  4.02503 0.727048 -1.125406
C  1.766885 -1.17352 -1.752479
C  2.874695 -1.516917 -0.716593
C  4.883074 -0.886377 0.564696
C  -3.175174 -0.202843 0.685746
C  -2.111614 -1.12086 1.245432
C  3.639699 1.955386 -0.254935
C  -0.148986 -1.053028 -0.23676
C  -2.894484 1.17055 0.464191
C  -4.465233 -0.703791 0.376418
C  -3.887252 2.025748 -0.06244
C  -5.459193 0.150518 -0.150515
C  -5.171325 1.517892 -0.370762
H  3.457918 0.765454 -2.070066
H  5.087998 0.876529 -1.385238
H  2.013432 -1.670068 -2.707324
H  1.673187 -0.093182 -1.941457
H  4.873889 -0.10458 1.345897
H  5.89183 -0.928376 0.113583
H  4.639817 -1.860754 1.012755
H  -2.544639 -1.99761 1.75115
H  -1.418699 -0.588187 1.918394
H  0.170386 -2.616828 -1.534615
H  -1.894743 1.55487 0.69563
H  -4.688699 -1.764158 0.547058
H  -3.662908 3.085058 -0.229737
H  -6.453603 -0.245269 -0.384806
H  -5.942254 2.18246 -0.776817
H  1.803946 1.065825 0.391738
H  2.195597 2.668515 1.009133
