program: Gaussian 09
title: 000297843
version: EM64L-G09RevD.01
frameworkgroup: C1[X(C20H22N2O5)]
method: RPBEPBE
basis: SDD
operation: Freq
keyword: #p
keyword: freq=noraman
keyword: PBEPBE/SDD
title: #p freq=noraman PBEPBE/SDD
converged: YES YES NO NO
title: Mulliken charges:
elementType: O O O O O N N C C C C C C C C C C C C C C C C C C C C H H H H H H H H H H H H H H H H H H H H H H
charge: -0.259056 -0.282619 -0.296998 -0.227374 -0.332755 -0.132933 -0.373759 -0.489907 0.241792 -0.449619 -0.624791 0.307694 -0.472695 0.440321 0.474225 -0.479868 -0.351954 -0.390564 0.311190 -0.369755 -0.388554 -0.226453 -0.221425 -0.237783 -0.228533 -0.225759 -0.233961 0.260732 0.254198 0.301952 0.245511 0.263170 0.224163 0.280322 0.236416 0.237173 0.364506 0.219517 0.235240 0.278316 0.243812 0.270848 0.232906 0.232492 0.229014 0.230794 0.226260 0.226289 0.228263
chargesum: 0.00000
title: Mulliken charges with hydrogens summed into heavy atoms:
elementType: O O O O O N N C C C C C C C C C C C C C C C C C C C C
charge: -0.259056 -0.282619 -0.296998 -0.227374 -0.332755 -0.132933 -0.009253 0.025023 0.241792 0.097844 0.142864 0.307694 0.000893 0.440321 0.474225 -0.025111 -0.073638 -0.146752 0.311190 -0.098907 -0.155648 0.006039 0.007589 -0.006989 -0.002273 0.000530 -0.005698
polarizability: 2.97340281e+02 2.66523295e+00 1.93885960e+02 -5.08650868e+00 -1.93888093e+01 2.20232391e+02
1716.lowfreq: -9.9999 -4.6548 -0.0007 -0.0002 0.0005 3.3677 4.7822 11.8890 16.5481
frequency: 1.5081 11.7650 16.3901 24.6720 32.2411 34.6062 49.6195 50.2114 61.4704 77.0809 93.4892 100.7565 128.7475 147.1439 154.2030 174.8226 181.1599 193.4039 221.2143 231.4895 264.3544 276.3907 309.5511 317.1197 348.2029 356.9270 363.9051 402.4930 403.7142 404.6208 434.3677 479.0598 485.3643 534.6629 545.6736 554.9987 589.3282 604.2444 615.8639 617.7767 624.9845 644.3541 678.7568 698.1613 704.5633 705.1674 714.8623 748.2025 758.5950 784.3590 811.1043 815.4710 816.2510 857.4362 860.1681 880.2157 891.4285 931.6775 933.4475 943.6389 957.1985 976.5776 979.1063 981.9372 984.8946 987.6448 989.9316 990.2086 999.3511 1000.0423 1006.0421 1025.3241 1027.1424 1078.7705 1090.5456 1093.8392 1126.7856 1132.4763 1165.2672 1172.7115 1173.9366 1188.4785 1191.4217 1206.0775 1211.6451 1216.2700 1222.0658 1228.6607 1231.4299 1238.0315 1245.3955 1319.9486 1327.2553 1329.6290 1333.4630 1343.2489 1349.3890 1385.6009 1386.2492 1401.7229 1423.8455 1440.9768 1442.1582 1459.1316 1460.0320 1462.0527 1473.0998 1482.7613 1484.6240 1484.7519 1487.5754 1493.0229 1594.3450 1594.5134 1600.0560 1613.4864 1614.7537 1639.7001 1646.1020 2945.5092 2983.6634 3029.3399 3031.8476 3041.2997 3047.1213 3070.1352 3103.5537 3107.4633 3115.5787 3119.4624 3125.9422 3126.6433 3128.5304 3130.7017 3139.0331 3139.9538 3149.9931 3151.7440 3163.9216 3166.3358 3493.6619
redmass: 4.9213 5.7357 4.9901 5.3506 4.5365 5.6620 4.0565 8.2503 5.3169 5.5140 7.4922 7.5971 4.3076 4.8432 1.0845 5.1591 3.4998 4.4430 4.7527 5.4438 5.2486 5.5982 5.7718 4.4898 2.1481 2.5857 4.5738 3.6420 2.8107 2.8311 2.2650 3.7894 3.5887 4.6610 4.1711 3.6256 5.3691 4.0190 6.3197 6.1940 4.8889 3.5202 1.3110 6.0497 2.0018 2.0936 4.1531 2.2899 2.1747 3.9873 5.3604 3.4802 3.7294 1.2500 1.2490 5.7189 5.5880 1.4444 1.5116 3.0682 2.8777 2.0174 1.8430 1.5240 1.5760 1.7430 4.6920 5.3938 1.3761 2.3726 1.4558 2.2015 2.2150 2.1050 1.5205 1.5379 1.3123 4.2099 2.9617 1.0541 1.0552 1.1243 1.1285 1.9619 2.0597 2.0227 2.8564 1.1316 1.4726 1.1642 2.0602 1.4331 1.2808 1.2588 1.2838 1.3387 1.2987 7.9598 7.7553 1.8432 1.4000 2.1133 2.1765 1.2092 1.1445 1.1087 1.7828 1.1497 2.2105 2.2489 1.1185 1.1670 6.0072 6.1062 6.6718 6.0712 6.0843 9.4404 9.2187 1.0691 1.0357 1.0587 1.0615 1.0581 1.0899 1.1014 1.1068 1.1026 1.1084 1.0861 1.0851 1.0874 1.0990 1.0885 1.0921 1.0927 1.0964 1.0966 1.1016 1.1016 1.0771
irintensity: 0.5490 0.0549 0.2148 0.1978 0.2147 0.1106 0.0685 1.2124 0.8237 1.7412 4.6103 13.6565 1.5805 4.0753 0.1372 3.8669 5.6211 4.9252 17.9970 0.7841 6.9720 3.6592 9.0393 1.9784 4.6445 24.4051 11.8428 3.0657 0.1142 0.1288 3.2778 12.0378 17.6090 4.2092 7.7386 3.3565 23.6426 24.2139 0.2452 0.3892 16.6211 7.1092 121.3388 31.3363 66.3450 41.3096 10.6565 78.3838 35.5029 8.5070 3.3994 8.6134 10.2221 0.2097 1.1843 30.1445 90.3496 11.9674 10.3926 16.5279 95.9164 9.5764 36.6652 11.1077 7.1527 1.9491 2.4776 2.3017 1.8399 129.3821 13.9899 4.0245 3.4738 102.5040 13.1113 8.3726 0.9189 36.1963 326.0324 0.2369 0.7662 0.8570 2.2268 27.8963 46.8041 23.7969 24.3512 22.8108 16.1150 7.0487 24.4620 43.1685 14.8444 1.8361 8.3589 14.6384 3.9472 0.6752 2.4206 102.3822 101.3078 8.9572 9.9950 67.3076 15.0745 40.3470 303.6748 86.6306 16.9326 42.2746 77.8824 8.5617 2.5326 4.3069 230.4062 1.7121 0.7324 212.9678 187.4209 42.7664 46.8655 34.6246 19.0482 32.4458 2.0674 18.4507 7.0459 5.0383 4.2362 4.6942 1.2045 1.7609 0.8831 1.5096 19.0980 12.4168 27.5444 27.5651 25.7454 17.8349 129.8431
temp: 298.150 k
press: 1.00000 atm
elementType: 8 8 8 8 8 7 7 6 6 6 6 6 6 6 6 6 6 6 6 6 6 6 6 6 6 6 6 1 1 1 1 1 1 1 1 1 1 1 1 1 1 1 1 1 1 1 1 1 1
symmnumber: 1
zpe: 1019227.9 jmol-1
zpe.correction: 0.388203 hartree
zpe.thermalcorrener: 0.414325 hartree
zpe.thermalcorrenthalpy: 0.415269 hartree
zpe.thermalcorrgfe: 0.323665 hartree
zpe.sumelectzpe: -1258.999120 hartree
zpe.sumelectthermal: -1258.972998 hartree
zpe.sumelectthermalent: -1258.972054 hartree
zpe.sumelectthermalfe: -1259.063658 hartree
dipole: -1.0684 -0.3207 1.8681
dipole: 2.1758
quadrupole: -143.8569 -148.7719 -153.8393
quadrupole: 3.4019 -6.0712 -12.3658
quadrupole: 4.9658 0.0508 -5.0166 3.4019 -6.0712 -12.3658
hfenergy: -1259.3873233 hartree
pointgroup: C01 [X(C20H22N2O5)]
dipole: -0.3872132 -0.3359374 0.6855749 debye
polarizability: 295.9361543|11.6128465|205.9141865|-2.9273089|-23.682991|209.6082921 unknown
InChI: InChI=1S/C20H22N2O5/c1-22(13-19(24)26-14-16-8-4-2-5-9-16)18(23)12-21-20(25)27-15-17-10-6-3-7-11-17/h2-11,21H,12-15H2,1H3
charge 0 multiplicity 1
49 atoms
O  -2.987829 -0.858622 1.727275
O  2.313403 0.622052 -1.263675
O  -1.067857 -2.072348 -2.690099
O  -4.880911 -1.265982 0.410104
O  1.28252 0.343285 0.848832
N  -2.565048 -2.75647 -1.039437
N  0.641206 -0.897926 -1.034055
C  -2.963349 -2.842323 0.379207
C  -1.384553 -2.160595 -1.46184
C  -0.443558 -1.60996 -0.371609
C  -3.547466 -3.222916 -2.040606
C  -3.745596 -1.592439 0.821595
C  -3.531068 0.492774 2.151105
C  -3.144014 1.559209 1.15226
C  4.539953 0.92887 -0.178883
C  3.267041 1.60195 -0.646977
C  -1.782896 1.934405 0.999664
C  -4.134038 2.189009 0.357543
C  1.393714 0.033288 -0.373664
C  4.616557 0.361773 1.12009
C  5.670956 0.858739 -1.03093
C  -1.422347 2.926092 0.062429
C  -3.772657 3.191731 -0.570541
C  -2.416062 3.561537 -0.719796
C  5.804059 -0.267655 1.554179
C  6.859844 0.230303 -0.597463
C  6.928476 -0.334261 0.69753
H  -2.08748 -2.977175 1.031367
H  -3.62359 -3.719504 0.497116
H  -0.977026 -0.934003 0.319799
H  -0.054114 -2.450283 0.242886
H  -4.500245 -2.677866 -1.918218
H  -3.729583 -4.307554 -1.923337
H  -3.134424 -3.028724 -3.041409
H  -3.049259 0.633116 3.131251
H  -4.625019 0.403366 2.26097
H  0.728349 -1.031308 -2.047868
H  3.458553 2.311339 -1.467745
H  2.745362 2.103765 0.186736
H  -1.000094 1.441353 1.589071
H  -5.181835 1.882966 0.457019
H  3.737451 0.408456 1.772938
H  5.617507 1.294102 -2.03654
H  -0.368106 3.199657 -0.055114
H  -4.544047 3.675443 -1.179842
H  -2.134147 4.334124 -1.443988
H  5.85498 -0.70251 2.558781
H  7.728669 0.182706 -1.26356
H  7.850516 -0.82019 1.036549
