program: Gaussian 09
title: 000297800
version: EM64L-G09RevD.01
frameworkgroup: C1[X(C9H10BrN3O)]
method: RPBEPBE
basis: SDD
operation: Freq
keyword: #p
keyword: freq=noraman
keyword: PBEPBE/SDD
title: #p freq=noraman PBEPBE/SDD
converged: YES YES NO NO
title: Mulliken charges:
elementType: Br O N N N C C C C C C C C C H H H H H H H H H H
charge: 0.000852 -0.297765 -0.405396 -0.434199 -0.096726 -0.428388 0.173373 0.333051 -0.277370 -0.180121 0.066307 -0.189494 -0.337734 -0.562382 0.237038 0.286887 0.300436 0.314672 0.307305 0.237254 0.231415 0.238593 0.248710 0.233680
chargesum: 0.00000
title: Mulliken charges with hydrogens summed into heavy atoms:
elementType: Br O N N N C C C C C C C C C
charge: 0.000852 -0.297765 -0.104960 -0.119527 -0.096726 0.095537 0.173373 0.333051 0.029935 0.057133 0.066307 0.041921 -0.099141 -0.079992
polarizability: 2.10898574e+02 3.37499909e+01 1.03913025e+02 -1.26627504e+01 -1.09761089e+00 1.10420186e+02
1716.lowfreq: -9.6790 0.0003 0.0006 0.0008 2.5466 5.7651 20.8865 30.7361 56.8828
frequency: 20.8423 30.6523 56.8498 60.6474 92.8776 137.7486 182.3102 232.5252 261.7122 285.1694 342.1884 346.9648 367.3810 412.7417 437.6525 508.4160 517.0276 550.8860 612.5703 627.9449 665.8701 680.1753 707.3264 733.7047 750.1921 785.5135 844.3668 903.8931 908.9674 928.3457 943.0021 955.7456 965.8092 1005.2310 1021.6447 1039.1507 1087.6131 1117.8697 1150.4589 1163.0596 1197.9135 1237.3082 1265.5028 1302.9752 1335.8225 1346.0856 1408.5962 1415.3102 1446.8695 1458.1395 1484.4339 1508.7698 1571.4134 1590.3397 1634.9792 1643.5222 2972.6375 3045.2820 3101.4932 3134.3556 3145.6079 3173.0727 3197.6480 3221.9972 3502.5347 3555.8723
redmass: 7.8551 6.0681 4.2798 7.8286 6.0753 4.1670 5.2657 4.1312 4.4713 3.9288 3.3085 4.6849 4.3271 3.5777 1.3934 3.2970 2.5196 4.9479 6.6880 4.1993 1.2283 1.1269 11.0438 5.5684 2.2620 1.7714 5.2621 1.2984 1.7537 1.3514 4.0328 1.4288 4.3521 1.3046 2.8660 2.2702 1.6592 3.1372 2.6413 1.0865 1.7339 1.1764 2.2804 1.7822 1.3437 3.8526 1.1754 1.9428 2.2734 1.0781 1.9197 2.5420 5.6087 5.6167 5.4176 5.8492 1.0631 1.0969 1.0644 1.0882 1.0911 1.0990 1.0963 1.1128 1.0759 1.0778
irintensity: 0.1863 0.3024 0.3096 4.7202 8.0161 4.2277 4.0586 1.2877 13.4375 8.4704 5.6958 0.7343 8.8404 3.8989 27.7366 9.6800 80.5090 26.3721 4.6561 1.1340 124.5837 3.7325 16.3126 2.9972 6.7262 94.5058 1.6996 2.3447 5.4473 75.9090 2.2991 2.8076 10.1516 2.0524 0.6775 7.1748 5.3156 24.8079 44.9027 12.8523 278.8800 99.4920 76.1887 70.5306 5.0347 19.0563 35.6811 105.7587 135.1972 21.5141 69.0743 1001.9072 48.8485 125.4854 157.1732 76.6696 56.7873 11.2393 2.3348 11.8926 18.2804 23.4151 8.3781 4.1079 25.0887 26.2514
temp: 298.150 k
press: 1.00000 atm
elementType: 35 8 7 7 7 6 6 6 6 6 6 6 6 6 1 1 1 1 1 1 1 1 1 1
symmnumber: 1
zpe: 474567.7 jmol-1
zpe.correction: 0.180753 hartree
zpe.thermalcorrener: 0.194282 hartree
zpe.thermalcorrenthalpy: 0.195226 hartree
zpe.thermalcorrgfe: 0.137195 hartree
zpe.sumelectzpe: -600.873636 hartree
zpe.sumelectthermal: -600.860108 hartree
zpe.sumelectthermalent: -600.859163 hartree
zpe.sumelectthermalfe: -600.917195 hartree
dipole: 0.5824 1.5809 -2.1471
dipole: 2.7292
quadrupole: -74.2516 -90.5731 -91.4081
quadrupole: 10.3665 -7.6392 -3.5539
quadrupole: 11.1593 -5.1621 -5.9971 10.3665 -7.6392 -3.5539
hfenergy: -601.0543894 hartree
pointgroup: C01 [X(C9H10Br1N3O1)]
dipole: -0.3753519 -0.3714883 -0.9348913 debye
dipolederiv: -0.1329007 -0.1217386 -0.0755428 -0.0785582 -0.5597959 -0.2073965 -0.0894417 -0.1763146 -0.1139805 -0.88798 0.0329562 -0.0349556 -0.074688 -0.4421341 0.1908079 0.0910771 0.2336017 -0.8584705 -1.8297729 0.1508291 -0.1542501 0.1085469 -0.4937645 -0.0451701 -0.2690787 -0.0492283 -0.3537388 -2.3750182 -0.1115317 0.1498586 -0.3572691 -0.3532004 0.0127978 0.4651934 0.0203674 -0.3604434 -0.8379124 0.0086846 -0.0991828 -0.1519839 -0.2632826 0.0248149 0.2574373 0.0445177 -0.3407879 0.7296039 -0.1211877 -0.1677832 0.2019949 0.0791617 -0.0355445 -0.5674372 -0.001907 0.1253812 1.9877066 0.0761862 0.0339051 -0.0454418 0.1360426 0.0129753 0.5514411 0.0399073 0.1165361 2.913786 0.0058209 0.0758899 0.3998422 0.4425965 -0.3062411 -0.287507 -0.4003479 1.1506601 -0.5780425 -0.0201143 -0.0012028 0.1395829 -0.1167362 -0.0003101 -0.4765114 -0.0306104 -0.1139432 0.3771081 0.0420967 -0.0195035 0.0432807 -0.0695745 -0.1190502 0.013271 -0.1175567 0.1964097 0.3052725 0.2479326 0.3071199 0.0356035 0.9052486 0.4057064 0.3571662 0.4085301 0.0382973 -0.1497779 0.0156353 -0.0117533 -0.069601 -0.1786472 0.0622977 0.1887789 0.0746562 -0.3201564 0.3286504 0.0001577 0.0959398 0.1225349 -0.0216682 -0.1429255 -0.2218159 -0.1648406 0.3174442 -0.4403272 -0.0989228 -0.0267447 -0.0697551 -0.2054739 -0.0077982 -0.0645276 0.0094154 -0.3559913 -0.1494209 -0.0366203 0.0016417 -0.1045909 -0.1081676 -0.0638825 0.0042262 -0.0987607 0.0804717 0.1805591 0.0144832 -0.0604253 -0.0024321 0.1241251 0.000672 0.0925674 -0.0068221 0.0343022 0.1279383 -0.0274251 0.0127527 -0.0855886 0.3102982 0.0850715 0.04491 0.0864505 0.1191394 0.1630764 -0.0175713 -0.0025807 0.0004543 0.2807868 0.0526432 -0.0639473 0.0531947 0.1697987 0.1921777 -0.0258305 0.0492467 -0.0213108 0.1627452 0.0405614 0.0499076 0.0376576 0.0780475 0.0540748 0.0174636 -0.0648805 0.0246572 0.121818 0.064053 -0.0891711 0.0635601 -0.0426419 -0.1250074 -0.0199415 -0.0149918 -0.0192123 0.1651525 0.0251514 -0.0259302 0.0241156 0.1057703 -0.0146195 -0.0410827 0.0791941 -0.0578126 0.1045776 0.064228 0.1183 0.0662112 -0.0180181 0.0482997 0.0797014 -0.0195224 0.0837396 0.0304192 -0.025047 -0.0357226 -0.0350656 0.181032 0.1125264 -0.049981 -0.0522291 -0.0219928 -0.0505269 -0.0884149 -0.0431857 -0.0807318 0.1648814 unknown
polarizability: 220.3753979|9.8716247|96.7622158|10.4637611|-4.6634559|108.0941712 unknown
InChI: InChI=1S/C9H10BrN3O/c1-7(10)6-12-9(14)13-8-4-2-3-5-11-8/h2-5,12-13H,1,6H2
charge 0 multiplicity 1
24 atoms
Br -3.440335 2.25806 0.852175
O  -0.391337 -0.774389 1.319457
N  -1.755832 -0.252628 -0.504969
N  0.556249 0.055581 -0.678776
N  2.702188 0.518219 -1.393438
C  -2.98873 -0.579447 0.212367
C  1.931491 0.059012 -0.359031
C  -0.514634 -0.351029 0.130529
C  2.467806 -0.360188 0.888364
C  3.866557 -0.293238 1.048868
C  -4.038877 0.512037 0.143871
C  4.682381 0.178661 -0.007995
C  4.050106 0.572508 -1.207935
C  -5.300673 0.372299 -0.320543
H  -3.446792 -1.508734 -0.183773
H  -2.688143 -0.773381 1.259157
H  -1.830633 0.089131 -1.463909
H  0.383998 0.412078 -1.624133
H  1.798275 -0.712639 1.674258
H  4.315286 -0.607637 1.997272
H  5.769798 0.241193 0.091938
H  4.631083 0.946407 -2.058474
H  -6.029189 1.186371 -0.307409
H  -5.625641 -0.594943 -0.724272
