program: Gaussian 09
title: 000297908
version: EM64L-G09RevD.01
frameworkgroup: C1[X(C23H24N2O6)]
method: RPBEPBE
basis: SDD
operation: Freq
keyword: #p
keyword: freq=noraman
keyword: PBEPBE/SDD
title: #p freq=noraman PBEPBE/SDD
converged: YES YES NO NO
title: Mulliken charges:
elementType: O O O O O O N N C C C C C C C C C C C C C C C C C C C C C C C H H H H H H H H H H H H H H H H H H H H H H H H
charge: -0.263550 -0.271078 -0.244801 -0.217026 -0.237342 -0.299785 -0.357759 -0.606964 -0.343432 -0.349031 -0.334215 0.587736 0.223811 0.239383 0.225441 -0.492657 0.168515 -0.477693 0.186619 0.158260 -0.345141 -0.800018 -0.786554 -0.537016 -0.209393 0.488860 -0.365610 -0.447593 -0.217997 -0.217788 -0.262845 0.312159 0.293919 0.300276 0.277934 0.243379 0.255906 0.307001 0.252121 0.234680 0.278908 0.257124 0.255939 0.266279 0.227636 0.266234 0.324256 0.375857 0.236042 0.242936 0.268362 0.232115 0.238379 0.227773 0.231449
chargesum: 0.00000
title: Mulliken charges with hydrogens summed into heavy atoms:
elementType: O O O O O O N N C C C C C C C C C C C C C C C C C C C C C C C
charge: -0.263550 -0.271078 -0.244801 -0.217026 -0.237342 -0.299785 -0.050758 0.093149 -0.031274 -0.055112 -0.033939 0.587736 0.223811 0.239383 0.225441 -0.214722 0.168515 -0.234315 0.186619 0.158260 -0.089235 -0.034309 -0.007212 -0.043145 0.269585 0.488860 -0.097248 -0.215478 0.020382 0.009985 -0.031396
polarizability: 3.12999160e+02 2.58110448e+01 2.73034972e+02 -2.48496938e+01 7.03529897e+00 2.23981154e+02
1716.lowfreq: -5.1943 -0.0008 -0.0006 -0.0004 4.3115 8.5720 14.6701 19.6378 26.6126
frequency: 14.3482 19.5998 26.5922 39.0073 42.3963 46.4349 48.3859 58.4767 64.5360 74.2415 79.9886 87.4666 99.5949 101.4383 130.1915 142.2009 153.7315 160.0909 167.0444 182.4017 186.2068 200.2570 221.5649 236.9805 250.3349 279.7101 292.0803 307.2074 317.1964 361.3786 370.6229 394.0163 403.3943 406.7718 419.3499 436.3070 473.0396 488.8549 505.1563 514.4998 539.2276 551.5153 573.9686 581.2887 601.5191 609.3929 614.4330 616.2906 635.2042 657.2793 674.1237 682.1693 705.9551 709.6093 719.2510 735.4515 757.7203 764.1897 781.9281 808.7044 811.4334 819.6219 835.7281 844.2778 858.9495 862.6212 886.4659 897.1017 914.3416 923.5062 926.2520 938.2132 952.6363 968.0721 976.2953 983.7758 989.9883 999.8160 1002.7160 1007.1238 1021.5690 1026.8001 1041.4949 1043.1036 1062.3084 1069.1067 1085.3503 1090.6800 1115.4008 1129.1357 1131.9037 1164.5553 1167.3445 1173.2325 1177.0558 1189.6284 1191.9498 1200.7704 1212.0964 1236.2475 1243.0555 1245.3240 1262.1579 1270.7316 1309.9397 1322.3174 1331.9837 1343.9390 1352.9580 1363.5718 1365.1988 1371.1529 1377.2355 1385.7079 1403.7633 1440.6323 1441.3708 1447.6395 1448.7622 1452.1425 1460.9314 1466.5539 1473.6567 1480.7789 1484.5543 1486.5728 1545.0854 1594.6748 1608.2619 1609.6214 1613.7334 1614.1364 1621.2662 1629.0683 1634.7022 2979.9042 2987.0069 2992.5646 2993.7972 3001.4290 3031.3628 3050.2291 3053.4397 3066.9271 3077.9524 3109.4245 3114.7564 3118.6899 3122.8938 3123.3466 3136.6183 3143.6306 3146.6341 3161.1269 3171.2886 3180.4679 3337.5022 3544.9880 3608.1735
redmass: 4.8238 6.0264 5.5301 4.8025 5.1871 5.5370 5.2240 6.0739 4.8657 4.1149 2.5956 5.7753 7.8113 4.8573 6.3302 1.0469 6.0017 5.7382 1.0715 6.0978 5.5180 4.7310 6.3410 6.7791 5.9422 4.7056 5.5124 2.9111 4.9419 4.0541 8.6793 5.1198 3.9034 2.9418 3.0647 3.4497 4.2010 4.0830 3.9552 3.4016 3.9331 2.9405 1.9113 4.2137 3.3852 1.9630 4.3197 6.2590 2.8968 2.8218 4.5859 4.2360 2.7144 2.4228 4.3142 5.2172 1.9638 3.3907 5.3128 1.3869 2.8699 1.5698 5.0984 3.2906 2.9431 1.2880 2.7401 1.7995 3.0530 1.7883 2.2902 1.4043 2.4094 2.3946 4.1221 1.3834 5.8258 1.5908 1.7710 1.9325 2.0782 2.2124 2.4747 3.1136 3.9189 1.4935 2.7643 1.7805 1.9629 1.2708 1.2825 2.0000 1.4683 1.0560 2.2874 1.2442 1.4583 1.4707 2.5891 1.2412 2.5612 1.8187 1.7059 1.4083 1.6590 1.3375 1.6793 1.4683 1.3859 1.2532 1.2741 1.9783 1.4482 5.7528 2.9483 3.9409 2.1276 1.0762 1.0834 1.0565 1.0714 1.1641 1.6377 1.7108 1.7959 1.9462 1.9411 6.0065 5.2576 7.2178 5.9771 4.1205 3.7367 8.3068 7.9481 1.0367 1.0406 1.0769 1.0606 1.0603 1.0823 1.0849 1.1009 1.0963 1.0931 1.1109 1.0871 1.1026 1.0867 1.1002 1.0915 1.0898 1.0958 1.1014 1.0926 1.0957 1.0588 1.0778 1.0931
irintensity: 0.3729 0.1245 1.4395 1.2155 1.5492 1.3864 0.9072 1.5596 0.5849 5.6254 16.1960 3.0828 11.8061 2.7867 9.1517 0.6117 0.3566 2.1146 0.4253 6.6635 1.1033 1.1120 1.6660 1.1686 3.6930 17.6465 3.8147 2.5300 3.5975 6.9621 1.5067 0.8884 3.3201 1.2876 7.1752 0.9438 13.6568 27.2045 4.8344 13.9005 8.3220 19.9177 23.1331 7.4251 33.9504 83.5783 21.6778 0.0928 10.4822 72.1351 29.8892 36.5420 20.7721 49.9133 3.5580 7.4299 46.9091 13.6345 10.5006 102.5763 2.6609 25.3858 30.2281 29.0254 2.3064 2.9750 6.5342 10.5455 2.0864 14.2755 4.7249 4.6774 4.9042 43.4782 96.1767 0.4385 0.0756 5.5455 1.4522 9.4529 2.2179 10.6651 3.4540 4.0169 19.6927 7.8287 5.3319 16.9832 4.3024 6.1240 6.4679 65.7112 78.3397 0.4142 68.7720 13.8864 22.0218 49.6549 2.5623 68.8396 170.9906 169.6187 45.0265 55.6266 22.2768 15.5357 14.7888 38.9933 6.8567 80.2306 0.4902 5.7863 87.2976 2.5483 5.2442 44.1568 29.0812 17.8673 20.8176 16.1342 14.9636 35.7183 38.3042 109.3114 100.2159 65.4914 181.9201 0.6369 125.5155 26.6524 5.1545 218.8181 67.5314 0.5304 215.5971 2.7741 2.0909 21.9133 39.7867 101.9526 0.2906 9.2358 7.7760 5.6180 7.6508 35.1495 7.3547 6.4352 0.6582 15.7385 18.4166 5.6570 24.9398 19.9857 0.5730 2.5069 169.0926 16.6581 69.2756
temp: 298.150 k
press: 1.00000 atm
elementType: 8 8 8 8 8 8 7 7 6 6 6 6 6 6 6 6 6 6 6 6 6 6 6 6 6 6 6 6 6 6 6 1 1 1 1 1 1 1 1 1 1 1 1 1 1 1 1 1 1 1 1 1 1 1 1
symmnumber: 1
zpe: 1129324.6 jmol-1
zpe.correction: 0.430137 hartree
zpe.thermalcorrener: 0.460068 hartree
zpe.thermalcorrenthalpy: 0.461012 hartree
zpe.thermalcorrgfe: 0.365788 hartree
zpe.sumelectzpe: -1449.449113 hartree
zpe.sumelectthermal: -1449.419183 hartree
zpe.sumelectthermalent: -1449.418238 hartree
zpe.sumelectthermalfe: -1449.513463 hartree
dipole: -3.5247 -0.9922 2.4027
dipole: 4.3796
quadrupole: -173.7464 -177.6277 -181.8170
quadrupole: -4.1857 -7.9254 6.1061
quadrupole: 3.9839 0.1027 -4.0866 -4.1857 -7.9254 6.1061
hfenergy: -1449.8792504 hartree
pointgroup: C01 [X(C23H24N2O6)]
dipole: -1.3681038 -0.5112658 0.9142269 debye
polarizability: 311.1892981|29.0903012|272.9218574|-23.2183799|10.5375435|225.90413 unknown
InChI: InChI=1S/C23H24N2O6/c1-13(26)19(22(24)28)21(16-8-9-17-18(10-16)31-12-30-17)20(14(2)27)23(29)25-11-15-6-4-3-5-7-15/h3-10,19-21,25H,11-12,24H2,1-2H3
charge 0 multiplicity 1
55 atoms
O  -1.181685 -2.974205 1.480192
O  -2.064087 -3.546458 -0.676929
O  0.176615 2.569447 -1.544668
O  3.400976 3.020522 -0.320775
O  4.230716 -2.194502 -0.699266
O  3.087395 0.467289 2.451247
N  -0.91876 2.432382 0.509455
N  3.682233 -1.704456 1.877702
C  1.984876 0.515669 -0.438835
C  1.448974 1.720432 0.394031
C  3.3955 0.001998 0.077209
C  0.933578 -0.591394 -0.538094
C  0.184084 2.276375 -0.311572
C  2.471111 2.875528 0.516355
C  3.977919 -0.978995 -0.951432
C  0.436182 -1.235748 0.63758
C  3.376877 -0.408406 1.565424
C  0.416014 -0.951028 -1.807843
C  -0.555725 -2.199662 0.47024
C  -1.067491 -2.544346 -0.799035
C  -0.59401 -1.941348 -1.964561
C  2.291127 3.799569 1.703207
C  4.257534 -0.416769 -2.336956
C  -2.217576 2.921854 0.007245
C  -2.281648 -3.696038 0.789038
C  -3.320291 1.869017 0.07931
C  -3.141814 0.603199 -0.536109
C  -4.542036 2.146052 0.739882
C  -4.168467 -0.364833 -0.494004
C  -5.57334 1.178673 0.781863
C  -5.389269 -0.079139 0.163954
H  2.157454 0.926605 -1.450068
H  1.198029 1.403978 1.420768
H  4.041208 0.902174 0.02935
H  0.807326 -0.986363 1.635061
H  0.777542 -0.422865 -2.696657
H  -0.988889 -2.207297 -2.948139
H  -0.875043 2.075491 1.466035
H  2.935538 4.686403 1.604783
H  1.235712 4.109345 1.815089
H  2.573869 3.237309 2.614441
H  5.140424 -0.919411 -2.764534
H  3.399465 -0.642619 -2.999496
H  4.401668 0.676238 -2.326468
H  -2.516687 3.824119 0.573869
H  -2.031043 3.225508 -1.039648
H  3.697886 -1.979814 2.859881
H  3.913988 -2.355816 1.111725
H  -3.245691 -3.2248 1.058089
H  -2.230678 -4.763824 1.051099
H  -2.201286 0.380844 -1.053046
H  -4.690758 3.121864 1.219797
H  -4.020403 -1.333995 -0.98521
H  -6.515146 1.40619 1.293777
H  -6.189595 -0.827341 0.190947
