program: Gaussian 09
title: 000297851
version: EM64L-G09RevD.01
frameworkgroup: C1[X(C21H24N2O6)]
method: RPBEPBE
basis: SDD
operation: Freq
keyword: #p
keyword: freq=noraman
keyword: PBEPBE/SDD
title: #p freq=noraman PBEPBE/SDD
converged: YES YES NO NO
title: Mulliken charges:
elementType: O O O O O O N N C C C C C C C C C C C C C C C C C C C C C H H H H H H H H H H H H H H H H H H H H H H H H
charge: -0.248345 -0.260696 -0.271499 -0.435115 -0.285520 -0.330041 -0.350362 -0.352261 -0.178804 -0.612898 0.475351 0.270971 -0.353820 -0.391112 0.247457 -0.541413 -0.391580 -0.402010 0.281362 -0.260181 -0.659712 0.345076 -0.473755 0.452088 -0.373270 -0.359437 -0.226920 -0.225116 -0.236621 0.293983 0.245046 0.236458 0.368333 0.258204 0.257902 0.256679 0.257142 0.256341 0.220306 0.237972 0.223621 0.336015 0.212312 0.231658 0.248270 0.228055 0.241194 0.352531 0.247093 0.239534 0.237305 0.229435 0.232793
chargesum: 0.00000
title: Mulliken charges with hydrogens summed into heavy atoms:
elementType: O O O O O O N N C C C C C C C C C C C C C C C C C C C C C
charge: -0.248345 -0.260696 -0.271499 -0.082584 -0.285520 -0.330041 0.017971 -0.016246 0.115179 -0.131393 0.475351 0.270971 -0.095616 -0.133211 0.247457 -0.027592 -0.135240 -0.181704 0.281362 0.201413 0.032528 0.345076 -0.004506 0.452088 -0.126178 -0.119902 0.010385 0.004320 -0.003829
polarizability: 2.70950525e+02 -3.28823373e+01 2.51552199e+02 7.37482730e+00 -2.64093978e+00 2.30622567e+02
1716.lowfreq: -4.0711 -1.4681 -0.0006 -0.0006 0.0007 4.5578 12.4164 14.0384 20.4739
frequency: 12.1228 13.5620 20.3443 23.7592 28.1935 36.7539 40.9100 47.8194 48.1285 66.6841 77.5388 81.5302 93.2823 104.4311 137.6898 147.1885 160.8861 177.4986 184.4862 206.8564 226.7757 251.8935 272.6294 301.0505 306.4801 329.4985 342.0092 352.6322 356.1128 383.7865 402.4974 403.6291 406.0220 419.3433 439.2358 455.7819 485.0088 498.3057 513.7147 551.9157 557.3756 573.8749 596.3623 614.8773 617.1094 630.2556 637.6507 671.1522 699.4768 701.9118 707.0544 714.6937 744.0982 754.1478 767.4022 785.9193 813.6718 814.5349 817.9758 819.9174 832.9267 849.2791 856.9395 863.9981 910.7790 916.3497 928.9800 935.2965 951.9211 973.3886 977.5055 983.1855 991.4122 999.2567 999.3869 1000.4428 1008.7378 1021.3462 1025.6565 1089.9248 1094.2762 1097.6223 1104.4231 1126.2574 1144.9789 1156.3481 1167.5233 1173.7019 1186.8248 1187.0620 1200.8320 1203.7854 1218.5979 1228.4784 1235.4453 1238.4674 1248.3440 1259.7729 1276.9770 1287.5745 1326.6808 1328.4641 1336.5036 1337.0966 1343.3487 1346.3071 1356.2989 1386.1234 1391.9819 1394.0949 1429.1072 1441.0705 1443.1786 1458.9536 1461.1282 1461.4408 1462.4161 1483.2172 1483.7231 1486.3658 1504.2944 1513.5522 1595.2097 1597.0327 1613.9990 1620.1964 1622.9243 1626.5397 1642.4506 2992.6753 3005.5644 3015.9364 3025.0823 3031.3576 3039.2429 3074.3433 3088.6763 3093.1921 3109.6533 3110.7556 3115.1172 3119.2620 3123.0576 3130.2001 3131.0689 3142.4347 3144.3228 3153.0231 3166.5548 3167.0127 3467.0046 3576.6218 3581.6007
redmass: 5.0911 5.8110 4.4639 5.8942 5.5748 5.0858 6.5583 3.0848 4.0058 5.7954 4.9780 5.4485 5.4018 7.3856 5.3638 5.4182 5.8783 3.3477 4.4749 1.6508 5.8201 3.8551 3.8465 4.4807 5.0733 3.7122 2.6067 2.0582 1.1950 3.4308 3.5312 3.0434 2.9134 3.0348 4.6869 3.8997 4.4254 4.1817 3.8114 1.2690 3.3407 3.3564 3.8756 4.2861 6.2741 4.6486 6.5070 1.4621 5.4342 2.3498 2.9693 3.9312 3.1767 2.4318 4.1090 2.7447 2.0295 3.2062 2.1812 1.8884 3.4209 1.5005 1.2729 3.0574 4.2767 2.6748 1.5328 2.0696 2.2403 1.6390 1.4834 1.4428 5.4791 2.2180 2.7143 1.3933 2.4558 2.9286 2.1999 1.5256 2.7702 2.1540 2.4375 1.8676 1.3819 1.6381 3.0498 1.0553 1.1226 1.2162 1.9507 1.7337 2.6155 1.6158 1.2636 1.8146 2.6705 1.5704 1.1293 1.7889 1.2667 1.3088 1.3216 1.2989 1.3521 1.2589 1.2934 7.8287 5.2707 1.2378 2.7185 2.1246 1.1258 1.0966 1.1504 1.0845 1.0693 1.0543 2.1832 1.8857 2.4393 1.9622 6.0990 6.0249 6.1210 8.0537 9.2943 6.3493 6.4109 1.0362 1.0674 1.0766 1.0629 1.0591 1.0582 1.1017 1.0974 1.1032 1.0888 1.1080 1.1018 1.1063 1.0861 1.0884 1.0896 1.0921 1.0953 1.0962 1.1012 1.0954 1.0799 1.0780 1.0660
irintensity: 0.0538 0.1779 0.3856 4.3935 0.5418 2.0568 4.4173 0.7231 0.3534 1.5082 3.4236 3.4332 1.5285 10.3866 1.3637 2.2949 2.0853 0.9005 7.1541 4.7864 1.0441 4.0408 9.9067 4.9237 3.1148 8.6145 5.8038 3.8727 152.7252 5.4814 0.6528 0.7605 7.6648 1.0833 9.0478 14.5260 6.7223 14.7269 21.2655 111.5397 52.0937 3.4825 13.3771 17.4890 0.9131 3.6646 1.5147 148.2613 8.9461 55.0702 49.3804 1.3383 24.7626 43.1494 18.9481 7.2828 22.1858 17.7491 11.0845 6.3376 8.5518 32.6240 1.6616 12.0807 93.8230 13.1575 0.3837 13.5009 21.4372 9.5913 3.1157 1.2563 0.9977 7.3001 1.0108 1.2021 5.7190 98.2136 4.3092 7.1018 51.2919 25.0803 104.7052 79.1108 172.6862 1.6895 186.0809 0.4070 0.5728 19.1466 10.2786 152.8958 20.3317 10.0027 2.0537 48.7321 31.3418 118.1353 5.9610 25.3660 2.9215 19.2552 2.2832 3.6811 3.9629 10.8600 1.3727 1.6205 14.0589 18.4748 9.3661 6.3159 27.3286 24.1743 13.6998 3.7123 21.4954 27.6689 56.7854 226.1710 257.4957 155.9767 1.3862 7.1518 0.4030 29.2404 160.3350 59.3284 396.9758 16.4752 14.4334 10.7868 18.8417 31.7634 35.4984 8.7903 40.7735 1.4706 19.0335 5.6498 6.9182 26.3840 3.1078 0.6066 1.8289 15.4928 7.9563 36.8145 12.2126 3.4636 90.4842 53.8545 38.1542
temp: 298.150 k
press: 1.00000 atm
elementType: 8 8 8 8 8 8 7 7 6 6 6 6 6 6 6 6 6 6 6 6 6 6 6 6 6 6 6 6 6 1 1 1 1 1 1 1 1 1 1 1 1 1 1 1 1 1 1 1 1 1 1 1 1
symmnumber: 1
zpe: 1103548.6 jmol-1
zpe.correction: 0.420319 hartree
zpe.thermalcorrener: 0.448993 hartree
zpe.thermalcorrenthalpy: 0.449937 hartree
zpe.thermalcorrgfe: 0.354937 hartree
zpe.sumelectzpe: -1373.378488 hartree
zpe.sumelectthermal: -1373.349814 hartree
zpe.sumelectthermalent: -1373.348870 hartree
zpe.sumelectthermalfe: -1373.443870 hartree
dipole: 0.9950 1.8375 -1.5151
dipole: 2.5811
quadrupole: -138.4662 -170.1259 -173.9459
quadrupole: -12.7277 8.6559 16.3277
quadrupole: 22.3798 -9.2799 -13.0999 -12.7277 8.6559 16.3277
hfenergy: -1373.7988073 hartree
pointgroup: C01 [X(C21H24N2O6)]
dipole: -0.3913984 -0.8363766 -0.4224371 debye
polarizability: 268.0559539|-33.9758484|253.9867662|4.0270974|-5.5275553|231.0825711 unknown
InChI: InChI=1S/C21H24N2O6/c1-2-28-20(26)18(12-15-8-10-17(24)11-9-15)23-19(25)13-22-21(27)29-14-16-6-4-3-5-7-16/h3-11,18,22-24H,2,12-14H2,1H3
charge 0 multiplicity 1
53 atoms
O  3.332054 1.810905 -0.273817
O  3.399649 1.52364 2.040652
O  0.571515 4.122973 -0.2035
O  2.951218 -4.503499 -0.927891
O  -3.459153 1.246269 -2.234354
O  -1.259653 0.379695 -2.219002
N  0.645375 1.797696 -0.407311
N  -1.697069 2.681009 -2.262231
C  1.213638 1.570967 0.918281
C  0.723668 0.221319 1.540674
C  1.307462 -1.030787 0.896331
C  2.75337 1.632684 0.971188
C  0.760698 -1.588584 -0.292452
C  2.434622 -1.66846 1.475006
C  0.360011 3.063089 -0.868669
C  -0.28239 3.088109 -2.276155
C  1.320791 -2.7372 -0.886339
C  3.004199 -2.822638 0.894383
C  2.44371 -3.355112 -0.291075
C  4.828969 1.861241 -0.317925
C  5.394119 0.461363 -0.570774
C  -2.064085 1.358888 -2.230788
C  -4.005842 -0.139962 -2.024759
C  -4.098242 -0.482811 -0.553174
C  -3.176441 -1.384641 0.034735
C  -5.105419 0.101336 0.258017
C  -3.253198 -1.69401 1.41166
C  -5.183169 -0.203823 1.634288
C  -4.255982 -1.102612 2.214318
H  0.869475 2.399339 1.568042
H  -0.380685 0.218907 1.476131
H  0.998533 0.249218 2.609147
H  0.444836 0.996679 -1.017225
H  -0.114938 -1.128198 -0.766046
H  2.874681 -1.252947 2.388714
H  0.270564 2.418493 -2.958986
H  -0.21576 4.120734 -2.651356
H  0.902831 -3.16537 -1.802215
H  3.872369 -3.303809 1.364463
H  5.192991 2.28206 0.635587
H  5.041958 2.553477 -1.148063
H  -2.429808 3.385192 -2.171211
H  6.494175 0.516833 -0.671677
H  4.980877 0.030781 -1.499005
H  5.1541 -0.215288 0.266438
H  -4.996724 -0.072526 -2.501157
H  -3.363319 -0.850231 -2.571858
H  3.727885 -4.864669 -0.432805
H  -2.397598 -1.839958 -0.586699
H  -5.82257 0.799555 -0.190437
H  -2.533828 -2.392432 1.853489
H  -5.963688 0.252803 2.252945
H  -4.317284 -1.341187 3.282071
