program: Gaussian 09
title: 000297844
version: EM64L-G09RevD.01
frameworkgroup: C1[X(C22H25N3O6)]
method: RPBEPBE
basis: SDD
operation: Freq
keyword: #p
keyword: freq=noraman
keyword: PBEPBE/SDD
title: #p freq=noraman PBEPBE/SDD
converged: YES YES NO NO
title: Mulliken charges:
elementType: O O O O O O N N N C C C C C C C C C C C C C C C C C C C C C C H H H H H H H H H H H H H H H H H H H H H H H H H
charge: -0.260058 -0.303753 -0.292509 -0.229946 -0.317319 -0.310284 -0.129476 -0.368938 -0.370018 -0.497114 -0.447347 0.244118 -0.624606 0.309936 -0.475785 0.443571 0.236862 -0.470558 0.458436 -0.476016 -0.352699 -0.391478 -0.229298 -0.230329 -0.365107 -0.386201 0.319539 -0.232530 -0.239684 -0.222698 -0.241387 0.255255 0.262545 0.313055 0.251423 0.226790 0.280348 0.264157 0.352002 0.237872 0.235166 0.255899 0.261885 0.220509 0.243112 0.268450 0.245841 0.357363 0.245560 0.227335 0.276912 0.234261 0.248299 0.230531 0.227756 0.230350
chargesum: 0.00000
title: Mulliken charges with hydrogens summed into heavy atoms:
elementType: O O O O O O N N N C C C C C C C C C C C C C C C C C C C C C C
charge: -0.260058 -0.303753 -0.292509 -0.229946 -0.317319 -0.310284 -0.129476 -0.016936 -0.012655 0.020687 0.117131 0.244118 0.146690 0.309936 -0.002748 0.443571 0.236862 0.047226 0.458436 -0.012395 -0.084249 -0.145637 0.016261 -0.002995 -0.088195 -0.151940 0.319539 0.015769 -0.009153 0.005058 -0.011037
polarizability: 2.97840023e+02 -1.10180599e-01 2.60119541e+02 4.16594019e+00 9.01424116e+00 2.34408519e+02
1716.lowfreq: -8.4704 -5.3401 -1.5018 -0.0008 0.0002 0.0004 10.2773 12.9810 21.4082
frequency: 9.1933 11.1715 21.3385 22.8584 25.9715 29.8365 37.0251 45.4803 51.8515 57.8819 66.6026 77.8778 86.1771 99.8898 104.2420 130.1017 137.6220 144.6089 173.1768 176.0390 181.5082 197.4957 221.3730 231.0867 253.5781 266.6522 293.7393 308.0716 317.8413 345.0769 351.7635 365.6384 380.3087 403.4646 404.2633 425.4759 454.9373 482.6009 494.6991 525.4077 539.6630 556.4533 581.4605 593.3199 607.2105 616.5682 617.7388 621.3834 630.9283 671.2466 690.7119 696.9393 703.5932 706.6786 716.9278 729.4657 749.6492 760.2702 787.9635 807.8852 815.4294 818.7799 859.2437 861.6987 873.7988 884.7031 932.8565 936.3368 936.9441 949.9570 951.6650 973.1643 976.5058 982.0720 984.5604 985.1159 989.8671 990.1035 994.5452 1000.3640 1001.4777 1007.5756 1026.8499 1027.1212 1074.3867 1090.6891 1093.7490 1097.6751 1126.7280 1142.1249 1165.0855 1172.4892 1177.7316 1189.0829 1192.7723 1198.5156 1208.7120 1210.7477 1218.2176 1219.7442 1220.3392 1234.0693 1236.9215 1240.9451 1248.1726 1315.2937 1329.4229 1330.4604 1331.6343 1338.0120 1345.8486 1350.6423 1384.4777 1385.6655 1405.3716 1424.4549 1441.8253 1443.4561 1460.1319 1462.6382 1463.6609 1470.6131 1476.0564 1481.0348 1484.4041 1484.9335 1485.1425 1492.3319 1498.3475 1593.3022 1593.5514 1595.2165 1610.9638 1614.0505 1615.8756 1638.0375 1659.4134 2958.9874 2963.0871 2985.4627 3034.7317 3036.9006 3042.4479 3050.7024 3052.3268 3071.5537 3107.8559 3110.6879 3117.5760 3119.9016 3125.4448 3126.6514 3129.5209 3129.5583 3140.1212 3140.9235 3149.6988 3152.3034 3164.0931 3165.3421 3442.7276 3508.8525
redmass: 5.6343 5.8810 5.5640 5.3699 5.7950 4.3658 4.2560 4.7416 8.0426 5.6429 4.7640 7.4404 6.7763 9.3911 5.6216 4.3102 1.0595 4.2946 5.4346 4.5381 3.6525 4.0368 4.6376 4.4393 5.6476 5.0637 6.5228 4.9820 5.9665 2.6726 2.4599 4.0163 3.2361 2.8140 2.8280 2.4076 3.4451 3.4441 3.9260 3.7286 5.4637 3.3821 4.0616 5.1905 3.8683 6.2989 6.2586 5.3240 4.4292 1.4142 2.8819 5.5948 2.1291 1.9515 1.6216 2.3475 2.3622 2.1236 3.8281 5.5834 3.4536 3.4774 1.2464 1.2494 5.6318 5.6504 2.0611 2.1587 1.4846 3.4473 3.0015 2.0305 1.9487 1.6475 1.4725 1.6834 4.6284 5.2050 2.2275 2.3545 1.3686 1.3354 2.2180 2.2158 2.3353 1.5235 1.5712 3.6840 1.3022 4.4824 2.7316 1.0539 1.0630 1.1214 1.1260 1.2090 2.0471 1.9641 1.7993 2.4861 1.5760 1.3858 1.1610 1.4353 1.8296 1.3845 1.2831 1.2558 1.3144 1.4695 1.3206 1.3963 8.0276 7.7664 1.7687 1.4640 2.1693 2.1121 1.1746 1.1344 1.1109 1.1649 2.0981 1.1963 1.5331 1.3694 2.2493 1.1896 1.8743 6.0657 5.9823 6.7841 6.0966 6.0503 6.3308 9.2651 9.5012 1.0674 1.0668 1.0354 1.0585 1.0611 1.0582 1.0938 1.0925 1.1018 1.1072 1.1036 1.1085 1.0860 1.0858 1.0879 1.0885 1.0990 1.0922 1.0925 1.0967 1.0961 1.1014 1.1016 1.0776 1.0769
irintensity: 0.5476 0.0493 0.2488 0.1299 0.2188 0.2804 0.0671 0.3578 1.7043 0.3751 0.5994 0.6172 1.1318 11.1670 14.9797 5.7976 0.3851 3.5535 5.5847 0.8955 8.0048 1.4743 4.7229 18.5337 10.5669 4.2617 2.8801 31.1133 2.2473 8.3597 3.8889 20.3182 8.9021 0.3871 0.0292 1.4541 11.8568 17.5844 6.2385 2.3398 3.6769 6.3039 14.3480 27.6903 25.0123 0.0801 1.2690 5.4274 5.2016 125.1722 35.3981 56.1846 36.2595 84.8793 126.1138 5.0503 56.7156 84.9743 9.3084 2.2729 11.5836 5.8833 1.0611 0.3343 44.4411 70.2641 24.2911 2.7689 6.2047 3.8753 78.6668 4.4013 30.2684 1.3330 0.9691 2.4473 2.7306 0.5707 16.7661 66.0079 10.9442 1.0741 2.9316 1.9082 37.1944 7.9481 14.3544 181.4199 0.4738 34.4187 227.7122 0.1127 0.5909 2.0141 3.2415 23.9465 40.0822 77.7861 7.2133 17.1839 36.9843 9.2105 6.6455 22.0068 25.2464 15.6433 3.5512 2.1418 1.3671 17.8308 9.7643 14.0169 0.7071 1.7248 73.4216 98.1995 9.2943 7.4702 20.7700 18.6452 50.1885 49.2686 568.1381 47.0132 4.8231 71.8949 26.8208 30.1516 112.5177 3.3996 3.2210 286.9554 21.5511 0.7089 91.7956 167.6148 279.4186 44.5412 37.1716 42.5471 43.3669 19.8981 30.5318 8.8446 1.9779 18.7967 6.3026 4.8973 3.6121 3.8696 3.9227 3.0289 0.3169 0.7282 19.0828 6.2865 20.8096 19.7348 14.6233 13.7334 122.9833 98.3240
temp: 298.150 k
press: 1.00000 atm
elementType: 8 8 8 8 8 8 7 7 7 6 6 6 6 6 6 6 6 6 6 6 6 6 6 6 6 6 6 6 6 6 6 1 1 1 1 1 1 1 1 1 1 1 1 1 1 1 1 1 1 1 1 1 1 1 1 1
symmnumber: 1
zpe: 1162491.2 jmol-1
zpe.correction: 0.442770 hartree
zpe.thermalcorrener: 0.473247 hartree
zpe.thermalcorrenthalpy: 0.474191 hartree
zpe.thermalcorrgfe: 0.374087 hartree
zpe.sumelectzpe: -1466.702732 hartree
zpe.sumelectthermal: -1466.672254 hartree
zpe.sumelectthermalent: -1466.671310 hartree
zpe.sumelectthermalfe: -1466.771414 hartree
dipole: 3.2598 1.7067 -1.2386
dipole: 3.8824
quadrupole: -156.6479 -178.8746 -183.7266
quadrupole: -12.6241 -0.8295 4.0625
quadrupole: 16.4351 -5.7916 -10.6435 -12.6241 -0.8295 4.0625
hfenergy: -1467.1455015 hartree
pointgroup: C01 [X(C22H25N3O6)]
dipole: 1.3549868 -0.5654107 0.4212463 debye
polarizability: 296.7667067|2.9965109|260.8821093|-8.9011028|7.6141728|234.7192661 unknown
InChI: InChI=1S/C22H25N3O6/c1-25(14-21(28)30-15-17-8-4-2-5-9-17)20(27)13-23-19(26)12-24-22(29)31-16-18-10-6-3-7-11-18/h2-11,23-24H,12-16H2,1H3
charge 0 multiplicity 1
56 atoms
O  3.815152 -0.722551 1.334749
O  3.034604 2.218353 -2.46132
O  -3.821756 1.544114 1.35192
O  4.922418 -1.923716 -0.344742
O  0.6860 2.200207 1.765916
O  -3.495919 2.539557 -0.772165
N  4.711281 1.047249 -1.342172
N  1.583109 2.729042 -0.316267
N  -1.847305 2.567193 0.896711
C  5.291792 0.515848 -0.092055
C  2.903953 2.173918 -0.023751
C  3.556306 1.809848 -1.373381
C  5.335651 0.6085 -2.608831
C  4.686699 -0.855339 0.262648
C  3.030003 -1.953736 1.760531
C  1.717528 -2.055302 1.019183
C  0.554858 2.659734 0.5837
C  -0.80476 3.182866 0.082933
C  -5.063967 -0.322097 0.258479
C  -5.160841 1.052309 0.888184
C  0.646257 -1.177342 1.333429
C  1.537013 -3.04284 0.017716
C  -0.590111 -1.294954 0.66161
C  0.297189 -3.16242 -0.650402
C  -4.803308 -0.460183 -1.130444
C  -5.231595 -1.488114 1.048322
C  -3.077402 2.251836 0.383223
C  -0.770019 -2.29257 -0.326439
C  -4.711701 -1.743257 -1.714788
C  -5.139341 -2.771862 0.465393
C  -4.880431 -2.901832 -0.919277
H  6.376001 0.380626 -0.247712
H  5.143428 1.215631 0.743713
H  2.793494 1.297886 0.63902
H  3.538966 2.909452 0.513904
H  6.368948 0.995734 -2.681079
H  4.737685 1.006031 -3.44197
H  5.356282 -0.494648 -2.657597
H  1.437753 2.978942 -1.304352
H  3.672072 -2.834487 1.591069
H  2.891811 -1.76946 2.837163
H  -0.818215 4.289475 0.169511
H  -0.976839 2.936918 -0.980205
H  -5.753096 1.036298 1.8168
H  -5.568883 1.794722 0.180826
H  0.781426 -0.388842 2.083692
H  2.368956 -3.708806 -0.239829
H  -1.568223 2.240726 1.827626
H  -1.414999 -0.617778 0.910111
H  0.164175 -3.931242 -1.419737
H  -4.661188 0.441605 -1.73644
H  -5.432703 -1.388512 2.122209
H  -1.73649 -2.385571 -0.834422
H  -4.516439 -1.839579 -2.788844
H  -5.271877 -3.665659 1.085157
H  -4.816102 -3.89682 -1.374526
