program: Gaussian 09
title: 000026820
version: EM64L-G09RevD.01
frameworkgroup: C1[X(C8H3F3I2N2)]
method: RPBEPBE
basis: SDD
operation: Freq
keyword: #p
keyword: freq=noraman
keyword: PBEPBE/SDD
title: #p freq=noraman PBEPBE/SDD
converged: NO NO NO NO
title: Mulliken charges:
elementType: I I F F F N N C C C C C C C C H H H
charge: 0.158949 0.140613 -0.112900 -0.156360 -0.156452 -0.427410 -0.000756 0.340868 0.237723 0.120521 -0.297970 -0.520832 0.254941 -0.339142 -0.126263 0.343194 0.268608 0.272668
chargesum: 0.00000
title: Mulliken charges with hydrogens summed into heavy atoms:
elementType: I I F F F N N C C C C C C C C
charge: 0.158949 0.140613 -0.112900 -0.156360 -0.156452 -0.084216 -0.000756 0.340868 0.237723 0.120521 -0.029362 -0.520832 0.254941 -0.339142 0.146406
polarizability: 2.29641919e+02 9.20420982e+00 1.79643377e+02 1.46329873e-02 -2.13097399e-03 5.24949500e+01
1716.lowfreq: -24.3911 -3.6264 -0.0009 -0.0005 -0.0004 1.7541 4.5818 50.4374 69.8315
frequency: -24.3022 50.4263 69.8285 85.5292 118.2006 121.4855 169.5967 178.5778 232.7121 273.3806 283.7428 331.3121 356.0686 379.0650 460.9416 485.4879 525.8835 556.0899 583.0759 597.7762 625.0896 656.4023 681.3193 702.1792 778.5745 829.3784 856.7648 876.9079 902.6105 926.8896 968.7618 1037.4325 1071.1635 1098.4427 1178.7120 1223.6406 1243.4787 1287.3713 1342.7971 1374.0909 1404.3994 1445.2709 1517.0910 1557.5705 1611.4385 3177.1857 3179.3132 3583.0010
redmass: 17.7179 11.9504 29.1479 30.2037 6.1651 10.1677 20.5472 19.8597 6.2219 9.9060 5.7998 12.2258 11.0677 12.8065 9.0751 11.9026 5.1819 7.7809 2.9913 9.8903 1.3336 10.5902 10.1953 10.4992 5.4709 6.8747 1.5598 1.3816 10.6445 8.4460 12.1500 8.3915 2.3449 5.2977 3.7911 1.8221 2.1943 2.8983 3.7275 4.2181 7.7332 3.7171 5.2741 9.6679 8.2075 1.0931 1.0937 1.0821
irintensity: 0.4532 0.8755 0.2586 0.1835 8.8684 0.0110 2.5517 1.1255 5.9958 2.9234 1.4926 2.5689 7.9805 0.4030 8.1888 1.3125 2.0839 4.7163 0.1514 12.7200 91.5210 0.4681 43.2576 0.8228 8.7747 27.5929 40.3659 4.5993 10.1101 108.5097 278.3617 192.5334 45.9212 147.4706 55.6361 192.2493 4.9383 191.7757 21.0556 41.7031 55.1842 41.4090 87.6891 111.9434 55.5077 0.0743 0.2128 96.1874
temp: 298.150 k
press: 1.00000 atm
elementType: 53 53 9 9 9 7 7 6 6 6 6 6 6 6 6 1 1 1
symmnumber: 1
zpe: 257175.9 jmol-1
zpe.correction: 0.097953 hartree
zpe.thermalcorrener: 0.110580 hartree
zpe.thermalcorrenthalpy: 0.111525 hartree
zpe.thermalcorrgfe: 0.055217 hartree
zpe.sumelectzpe: -737.636091 hartree
zpe.sumelectthermal: -737.623464 hartree
zpe.sumelectthermalent: -737.622520 hartree
zpe.sumelectthermalfe: -737.678828 hartree
dipole: -3.0471 -2.8135 -0.0001
dipole: 4.1473
quadrupole: -128.4855 -100.1739 -117.4829
quadrupole: -0.1749 -0.0001 -0.0008
quadrupole: -13.1048 15.2069 -2.1021 -0.1749 -0.0001 -0.0008
hfenergy: -737.7340446 hartree
pointgroup: C01 [X(C8H3F3I2N2)]
dipole: -0.8504178 1.3925382 -0.0006513 debye
dipolederiv: 0.0522666 0.015959 0.0000916 0.0080921 -0.4972907 0.0001651 0.0001658 0.0000337 0.0567936 -0.4258863 0.2172968 -0.0001646 0.2469445 -0.1337572 0.0002381 0.0000216 -0.0000318 0.0281353 -0.6156546 0.2090279 -0.0005009 0.2529662 -0.5975568 0.0007165 -0.0003875 0.0007273 -0.256756 -0.7623662 -0.1388248 0.1598274 -0.284481 -0.4240065 0.2295122 0.2576081 0.2067278 -0.6335299 -0.7613417 -0.1390076 -0.1595522 -0.284851 -0.4252843 -0.2303055 -0.2565215 -0.2073782 -0.6325506 -0.4374969 0.0659095 -0.0001408 -0.2633575 -0.5741867 -0.0000551 -0.0000495 0.000195 -0.230684 -0.1286257 -0.1766134 0.0000015 0.0870341 -0.3247332 0.0001058 -0.0002033 -0.0001055 -0.2067606 0.3681806 0.0753362 0.000066 0.1015619 0.1109268 0.0000254 0.0001047 0.0001357 0.0982119 0.0179656 0.1516928 -0.0001141 -0.1378889 -0.504571 0.0000762 0.0000837 0.0001601 0.0706493 -0.7154916 -0.1879579 -0.0000401 -0.044321 0.6439292 -0.0001785 -0.000653 -0.0003206 -0.0593006 -0.3895296 -0.0081978 -0.0000852 0.1737247 -0.182212 0.0000846 -0.0000447 -0.0001535 -0.1294498 0.2807299 -0.15245 0.0001778 0.1625791 1.3007076 -0.0002866 -0.0000409 -0.0002841 -0.1605903 2.6643768 0.144075 0.0003632 0.2233779 1.3996847 0.0000626 0.0000367 0.0000852 1.5698765 0.9588813 -0.4245907 0.0004398 -0.661219 0.5349847 -0.0005724 0.000265 -0.0000712 -0.1623977 -0.4516553 0.3714836 -0.0003279 0.3885592 -0.6266903 0.0002579 -0.0002726 0.0002792 -0.0514787 0.2299202 0.0356826 -0.0000628 0.0650251 0.2417042 0.000042 -0.0000518 -0.0000159 0.3547284 0.0897826 -0.0060736 -0.0000257 0.0109613 -0.0186006 0.0000671 -0.0000244 0.0000425 0.1845029 0.0259444 -0.0527478 0.0000471 -0.0447076 0.0769521 0.0000445 -0.0000363 -0.0000258 0.1606003 unknown
polarizability: 221.0609704|-20.9790044|188.2242999|0.0577832|-0.0389405|52.4949761 unknown
InChI: InChI=1S/C8H3F3I2N2/c9-8(10,11)7-14-5-2-3(12)1-4(13)6(5)15-7/h1-2,14H
charge 0 multiplicity 1
18 atoms
I  -1.630419 -3.49578 0.000166
I  -4.861604 1.726076 -0.002362
F  3.682901 -1.049683 0.003462
F  3.518422 0.917432 -1.130871
F  3.517541 0.920866 1.131573
N  0.765443 1.245428 -0.000126
N  0.845968 -1.044694 0.000395
C  -0.567107 0.821686 -0.000523
C  -0.493418 -0.618416 -0.000146
C  1.556541 0.090076 0.000534
C  -1.78374 1.534117 -0.001136
C  -1.695858 -1.367268 -0.000393
C  3.048141 0.189308 0.001184
C  -2.949403 0.746117 -0.001354
C  -2.924984 -0.68085 -0.001011
H  1.103042 2.208017 -0.000089
H  -1.826779 2.625623 -0.001464
H  -3.863287 -1.239956 -0.001238
