program: Gaussian 09
title: 000297818
version: EM64L-G09RevD.01
frameworkgroup: C1[X(C19H27N3O6)]
method: RPBEPBE
basis: SDD
operation: Freq
keyword: #p
keyword: freq=noraman
keyword: PBEPBE/SDD
title: #p freq=noraman PBEPBE/SDD
converged: YES YES NO NO
title: Mulliken charges:
elementType: O O O O O O N N N C C C C C C C C C C C C C C C C C C C H H H H H H H H H H H H H H H H H H H H H H H H H H H
charge: -0.262328 -0.227874 -0.277552 -0.283500 -0.310567 -0.312425 -0.374155 -0.346039 -0.370738 0.013759 -0.402192 -0.166850 -0.724281 -0.733945 0.196712 0.235526 -0.522211 -0.498700 0.251751 -0.460622 0.468620 -0.478721 0.317205 -0.368988 -0.385346 -0.228174 -0.225955 -0.233333 0.201466 0.222107 0.207550 0.289488 0.215422 0.215775 0.207632 0.208189 0.264604 0.201575 0.371805 0.254869 0.264867 0.324139 0.235881 0.242563 0.245457 0.263015 0.257338 0.368465 0.242518 0.219865 0.271020 0.233074 0.226880 0.226660 0.228701
chargesum: 0.00000
title: Mulliken charges with hydrogens summed into heavy atoms:
elementType: O O O O O O N N N C C C C C C C C C C C C C C C C C C C
charge: -0.262328 -0.227874 -0.277552 -0.283500 -0.310567 -0.312425 -0.002350 -0.021899 -0.002273 0.215225 0.027465 0.122638 -0.085452 -0.059577 0.196712 0.235526 -0.002475 0.225200 0.251751 0.059731 0.468620 -0.016338 0.317205 -0.097967 -0.152272 -0.001293 0.000705 -0.004632
polarizability: 2.85143140e+02 -3.63073302e+00 2.45666108e+02 1.55801245e+01 -2.67046269e+00 1.97021785e+02
1716.lowfreq: -12.9710 -3.3891 -0.0004 0.0006 0.0008 3.1605 6.0870 7.7135 13.5879
frequency: -6.9077 7.2931 12.6642 19.2200 30.4509 35.5382 39.3022 49.4320 59.5600 67.2860 77.2414 79.8011 84.7456 90.1612 100.0968 103.0552 131.6089 151.7546 171.4738 175.3103 192.5847 209.6803 217.5446 223.4311 240.7364 243.8444 254.2345 267.4657 291.8742 312.9032 328.7550 332.7508 367.2777 389.9710 403.6844 411.5702 413.5395 451.4979 470.1528 499.9141 530.6251 550.3632 578.4148 581.2313 599.9324 617.2467 622.2997 654.8845 665.6241 679.1265 699.7608 700.9330 705.8544 741.2195 751.9331 760.8926 815.7386 815.7853 829.2402 847.3587 858.7458 861.5682 895.9615 923.7625 929.6082 935.7189 948.1664 955.7468 960.2161 972.8783 981.7457 984.3706 986.0820 990.4035 994.7767 1000.5681 1011.3992 1027.1295 1046.0819 1091.1089 1100.9452 1113.0840 1129.7376 1135.2475 1150.0327 1152.7409 1171.3045 1173.1657 1178.3077 1189.3221 1204.2707 1213.1063 1221.8709 1224.5357 1231.9565 1239.9809 1255.4432 1265.2648 1278.4284 1301.9720 1321.5371 1327.2817 1330.8478 1336.8739 1340.3667 1341.2270 1353.5940 1381.4374 1385.6327 1398.9437 1422.3872 1440.6454 1442.3266 1452.9360 1454.1788 1460.7967 1464.1510 1470.2664 1472.6914 1473.5336 1476.9096 1482.8749 1484.8530 1498.5845 1505.1410 1523.2748 1594.6787 1601.3101 1614.7701 1627.4753 1644.6823 1650.4055 2963.3881 2966.7141 2968.5765 2970.8156 2975.8745 3006.8133 3007.5187 3027.5508 3034.4614 3038.5147 3056.8359 3059.5213 3066.4754 3070.8797 3076.9523 3108.1280 3109.8070 3118.9517 3119.3476 3126.8203 3139.4856 3150.6359 3152.9133 3164.1595 3408.4917 3511.1074 3551.8598
redmass: 4.5149 4.9431 5.5288 5.3763 4.2083 6.6674 5.2111 3.5449 5.4889 4.4722 5.2334 4.7009 4.6099 3.0354 1.1883 5.0627 3.6673 3.8204 4.5083 3.8586 4.5109 1.9472 2.6730 2.2455 1.3152 5.9313 3.5006 3.3682 5.2915 5.0757 3.8223 3.0464 2.4863 2.4042 2.8192 2.3844 3.3277 2.9416 3.7339 3.2201 2.8925 2.6730 1.6541 3.8371 4.3496 6.4249 4.9686 1.1386 4.3103 4.5943 5.9064 4.9943 2.1112 1.2311 4.7304 2.4273 3.3157 3.3774 2.7493 3.3236 1.2493 2.7531 4.1205 1.2455 3.9981 1.5152 2.5831 1.4950 2.5505 2.7798 1.5362 2.1573 2.2915 4.3626 2.8036 1.3423 2.4198 2.2207 5.1341 1.5211 2.9405 1.2806 2.2866 3.6359 1.4485 4.8856 2.2734 1.0540 1.8416 1.1237 1.4160 1.3030 2.8433 1.4804 1.3762 1.1616 1.7328 1.3471 1.6428 1.3144 1.4875 1.5114 1.2549 1.3844 1.3478 1.4387 1.3688 1.2058 7.9687 1.2056 1.1850 1.1356 2.1727 1.0501 1.0852 1.2012 1.0505 1.0596 1.7481 1.0918 1.1335 1.0564 2.2514 1.0471 2.1188 1.8092 6.0997 6.7008 6.0595 6.1341 8.7856 9.1366 1.0607 1.0393 1.0635 1.0530 1.0580 1.0295 1.0990 1.0624 1.0587 1.0971 1.0884 1.0988 1.0985 1.0991 1.0997 1.1071 1.1047 1.1022 1.0863 1.0874 1.0921 1.0963 1.1050 1.1016 1.0806 1.0776 1.0786
irintensity: 0.0444 0.0398 0.0370 0.0767 0.3860 1.6362 0.7130 0.9500 0.5732 4.2663 2.7770 4.0589 8.6968 3.9608 0.1659 17.4072 10.4600 5.5247 1.9967 3.2081 0.0973 0.9108 4.5993 9.8770 1.9573 20.7384 7.7055 9.4218 3.7017 12.9098 9.1588 7.3798 20.7656 0.9870 0.0519 0.9789 8.1748 18.8220 7.0477 5.6894 50.4403 25.6156 80.5703 0.5431 19.8251 1.2075 5.1555 132.7890 8.9978 5.0923 19.4411 3.0796 62.9395 195.2123 21.2485 40.1585 0.4863 16.3665 0.9449 8.7774 0.3003 5.7635 36.8227 3.7796 5.3176 6.9350 21.9696 2.2432 86.2356 1.4721 13.8721 2.7491 77.3046 2.3995 70.2173 1.2262 4.9011 3.9327 31.2287 9.7479 3.2511 1.0384 7.0781 260.7285 14.1063 139.7265 23.6903 0.1379 10.8505 1.6992 27.4493 34.7083 24.5075 35.0132 7.5380 14.6150 57.7389 45.0608 20.1273 17.3459 53.8664 64.7243 2.7825 5.6029 24.1644 9.6329 15.4594 20.5329 0.6858 25.3549 18.8164 59.9249 9.5077 14.0571 14.5521 36.6059 15.1230 10.4591 452.7510 92.4563 172.7193 3.9969 37.1840 20.0405 29.8419 240.0689 3.8657 73.3853 0.3079 354.7945 108.6828 256.4123 37.1835 25.8668 10.9485 45.7716 32.5997 34.4998 16.8295 14.7228 34.4889 8.7747 6.9810 13.2743 81.7614 53.3486 24.8919 6.0070 23.7048 4.3829 5.3362 1.8458 20.5671 25.3959 14.4034 23.5099 143.1126 132.4878 33.9156
temp: 298.150 k
press: 1.00000 atm
elementType: 8 8 8 8 8 8 7 7 7 6 6 6 6 6 6 6 6 6 6 6 6 6 6 6 6 6 6 6 1 1 1 1 1 1 1 1 1 1 1 1 1 1 1 1 1 1 1 1 1 1 1 1 1 1 1
symmnumber: 1
zpe: 1170987.6 jmol-1
zpe.correction: 0.446006 hartree
zpe.thermalcorrener: 0.475575 hartree
zpe.thermalcorrenthalpy: 0.476519 hartree
zpe.thermalcorrgfe: 0.379468 hartree
zpe.sumelectzpe: -1353.737238 hartree
zpe.sumelectthermal: -1353.707669 hartree
zpe.sumelectthermalent: -1353.706724 hartree
zpe.sumelectthermalfe: -1353.803776 hartree
dipole: 0.0598 0.5083 0.0231
dipole: 0.5123
quadrupole: -163.0084 -151.5770 -165.7380
quadrupole: 12.4786 8.8216 9.9092
quadrupole: -2.9006 8.5308 -5.6302 12.4786 8.8216 9.9092
hfenergy: -1354.1832439 hartree
pointgroup: C01 [X(C19H27N3O6)]
dipole: -0.0221582 0.1881044 0.068929 debye
polarizability: 284.7858656|-3.3758223|236.5102542|16.6811477|19.0534083|206.5349132 unknown
InChI: InChI=1S/C19H27N3O6/c1-13(2)9-15(18(25)27-3)22-17(24)11-20-16(23)10-21-19(26)28-12-14-7-5-4-6-8-14/h4-8,13,15,20-22H,9-12H2,1-3H3
charge 0 multiplicity 1
55 atoms
O  -6.051845 2.21862 1.055267
O  -4.246262 1.700618 2.434876
O  -4.683725 -2.293283 -0.053295
O  3.269446 1.172401 -0.343768
O  -0.672082 -0.531114 1.389502
O  3.29539 -0.871916 -1.540061
N  -3.540513 -0.407919 0.73832
N  -1.310152 -2.540856 0.419168
N  1.619245 -0.349316 0.004278
C  -3.624229 0.545461 -2.224096
C  -3.958241 1.397646 -0.972094
C  -4.506897 0.573732 0.236452
C  -2.912783 1.431664 -3.27458
C  -4.88255 -0.125436 -2.825397
C  -4.887607 1.52493 1.375055
C  -3.705762 -1.762744 0.560587
C  -2.574609 -2.620841 1.1776
C  -6.504011 3.216098 2.057779
C  -0.428512 -1.502649 0.599599
C  0.883593 -1.588741 -0.192434
C  5.758242 1.11629 -0.146958
C  4.574573 1.548136 -0.98616
C  2.770563 -0.093986 -0.694366
C  6.323575 -0.175178 -0.312354
C  6.316648 1.997376 0.813442
C  7.426304 -0.576456 0.473716
C  7.4196 1.597097 1.600305
C  7.977159 0.308234 1.430874
H  -2.919693 -0.255055 -1.915155
H  -4.718544 2.15754 -1.238436
H  -3.049147 1.940577 -0.641908
H  -5.407128 0.018767 -0.080548
H  -1.98871 1.88337 -2.867122
H  -2.63788 0.841043 -4.167899
H  -3.574248 2.254925 -3.607848
H  -4.625927 -0.66629 -3.755282
H  -5.327422 -0.859038 -2.130159
H  -5.647444 0.63455 -3.078635
H  -2.715371 -0.076508 1.260336
H  -2.920567 -3.665523 1.184787
H  -2.37404 -2.291374 2.212737
H  -1.117922 -3.254061 -0.286654
H  -7.409032 3.660378 1.621313
H  -5.72179 3.976678 2.218967
H  -6.726716 2.715952 3.014957
H  1.469626 -2.464799 0.155339
H  0.67897 -1.756071 -1.26886
H  1.246974 0.315569 0.689972
H  4.599487 1.09187 -1.990832
H  4.503925 2.644782 -1.060807
H  5.88302 -0.858205 -1.047459
H  5.883482 2.996578 0.946077
H  7.857608 -1.574813 0.339096
H  7.844642 2.28589 2.338992
H  8.834692 -0.003103 2.038279
