program: Gaussian 09
title: 000297824
version: EM64L-G09RevD.01
frameworkgroup: C1[X(C21H21N3O4)]
method: RPBEPBE
basis: SDD
operation: Freq
keyword: #p
keyword: freq=noraman
keyword: PBEPBE/SDD
title: #p freq=noraman PBEPBE/SDD
converged: YES YES NO NO
title: Mulliken charges:
elementType: O O O O N N N C C C C C C C C C C C C C C C C C C C C C H H H H H H H H H H H H H H H H H H H H H
charge: -0.292805 -0.441600 -0.217249 -0.306312 -0.105028 -0.403295 -0.115416 -0.552284 -0.137212 0.197802 -0.552025 -0.334224 -0.227404 0.492462 0.172443 -0.448122 -0.331838 0.314176 -0.215122 -0.233447 -0.478793 -0.244562 0.448704 -0.372813 -0.374353 -0.229347 -0.245562 -0.252652 0.255024 0.262330 0.289858 0.248796 0.238688 0.296124 0.266664 0.370674 0.232782 0.251277 0.229431 0.233083 0.222903 0.242661 0.231388 0.392968 0.239976 0.278344 0.234385 0.233728 0.234792
chargesum: 0.00000
title: Mulliken charges with hydrogens summed into heavy atoms:
elementType: O O O O N N N C C C C C C C C C C C C C C C C C C C C C
charge: -0.292805 -0.048631 -0.217249 -0.306312 -0.105028 -0.032621 -0.115416 -0.034930 0.152646 0.197802 -0.064540 -0.038100 0.039260 0.492462 0.172443 -0.215341 -0.080561 0.314176 0.014309 -0.000364 -0.013229 -0.013174 0.448704 -0.132836 -0.096009 0.005039 -0.011835 -0.017860
polarizability: 2.87577926e+02 -1.89885146e+01 2.13623676e+02 6.81082615e+00 -1.38932475e+01 2.21759028e+02
1716.lowfreq: -8.4298 -5.3607 -4.1863 -0.0005 -0.0005 0.0003 8.1816 15.5703 21.1416
frequency: 7.1304 15.2914 20.7787 27.7902 31.8049 40.6631 47.5147 56.6877 67.0354 84.8294 95.4200 103.3585 114.6258 153.5257 158.7031 197.9519 219.3099 225.4078 264.4785 282.2744 294.5733 308.1052 336.9803 348.5362 387.5091 396.0469 403.5358 404.3439 453.6025 463.0555 489.9251 526.1304 557.2297 569.9266 591.0715 599.7688 614.0763 616.9475 623.8143 627.3725 651.2351 663.2741 686.1652 701.2662 703.4353 705.9544 723.8327 745.2562 760.1926 767.2072 774.2231 801.0490 807.9248 815.7930 836.4690 855.1513 860.3357 874.8070 908.2027 910.3971 931.9242 935.6098 959.8057 967.6933 980.0503 980.3875 984.7105 987.7422 990.3770 991.1771 1000.0056 1000.1738 1023.5006 1026.1206 1026.6887 1074.6974 1087.0018 1090.0754 1119.7273 1155.2972 1167.8466 1172.2338 1173.2571 1180.9068 1189.4207 1190.5808 1201.0274 1209.7267 1218.1510 1218.8578 1226.5898 1235.1544 1292.4041 1302.7603 1304.2759 1323.3011 1330.2343 1338.6121 1344.9025 1348.7683 1356.4609 1378.5405 1382.9706 1387.3683 1437.2647 1440.2632 1446.4966 1457.2692 1460.6243 1475.7413 1475.9847 1483.6147 1486.3707 1555.5853 1591.3089 1595.8345 1611.9590 1614.7264 1654.0101 1678.7225 2998.0480 3016.9712 3028.0785 3037.9249 3050.8940 3093.4651 3110.4396 3116.3564 3120.3193 3124.9145 3127.1007 3136.5139 3140.9711 3147.5908 3153.6876 3164.5273 3164.8145 3226.7742 3235.4979 3540.2540 3555.9232
redmass: 5.7011 5.3863 5.4731 4.4564 5.3048 5.5036 4.4385 6.2251 5.9131 6.5790 7.2952 6.7859 5.7090 6.1346 6.5598 4.4844 5.6871 4.8360 6.0666 5.7984 5.2950 2.9001 3.4636 2.6337 2.8105 2.8455 2.8138 2.8201 3.5872 3.2404 3.8542 3.6804 3.6297 3.1178 2.3510 3.4107 4.9644 6.2693 1.4959 2.8131 5.1507 3.9770 3.6601 3.6320 2.8046 2.4793 1.7890 2.2141 1.7348 2.1659 2.5188 1.9557 3.0424 3.3048 4.0358 1.2482 1.2456 4.4862 4.0043 1.4119 2.2237 1.8946 2.3831 1.9095 1.6758 1.5783 2.0134 2.9672 6.1462 5.1738 1.3364 1.3151 4.8955 2.2430 2.2619 1.8716 1.5800 1.5297 3.7849 1.6846 1.5413 1.0590 1.0653 1.4383 1.1287 1.1216 1.8500 2.1747 2.8637 1.5287 1.2697 1.1603 1.5714 2.9674 1.5695 1.9811 1.2615 1.6936 1.4237 1.6640 2.4036 2.3805 7.8067 4.1546 2.3712 2.1488 2.1192 1.1491 1.1263 1.6058 1.6910 2.2381 1.8990 5.7905 6.0417 6.0766 6.0349 5.9678 9.7792 9.2823 1.0593 1.0773 1.0670 1.0585 1.1036 1.1028 1.1073 1.0876 1.0863 1.0863 1.0882 1.0913 1.0922 1.0961 1.0961 1.1015 1.1011 1.0985 1.1009 1.0645 1.0776
irintensity: 0.0509 0.1307 0.1829 0.2211 1.7984 0.2082 0.3340 0.6740 1.6213 7.0028 5.6183 0.2447 1.2299 0.1906 0.7411 3.0510 2.7447 1.3787 5.2658 1.3910 4.7967 8.9972 1.0978 5.2628 7.8313 2.1014 0.1303 0.1801 7.6194 14.6497 9.7315 66.7734 30.9354 32.7765 4.8659 69.1125 5.6181 0.4117 121.6636 16.1258 4.8396 8.8531 78.8370 46.0036 14.6297 80.3373 50.1314 47.1548 36.7931 7.9842 16.0635 32.3231 5.1786 10.8453 4.1774 0.4196 0.7014 15.2892 2.1159 0.7368 17.5278 6.1568 64.4121 13.5008 34.7749 33.2859 80.8881 53.3253 1.9219 17.2958 0.8896 0.4387 5.1896 3.8115 9.7687 183.4433 11.0003 8.0563 37.1593 29.5129 14.9121 0.1223 0.2081 6.9504 2.8591 1.0478 95.4338 0.9411 18.6178 25.1151 0.4461 5.8973 29.1087 19.5816 15.7741 27.2991 0.9030 11.2031 4.7549 9.2221 3.5535 3.5858 1.1558 4.5992 35.7932 7.1309 1.8287 11.0393 41.6044 164.6495 247.9690 28.0065 20.2843 1.3047 1.3401 0.4170 0.1924 3.6488 225.3113 249.0945 27.9732 7.9895 22.5655 40.1209 6.2470 3.0863 4.8937 7.2705 3.7187 0.4800 2.8292 11.5741 19.1405 34.9410 17.3274 21.6442 13.4722 4.5544 1.0275 30.3372 82.1114
temp: 298.150 k
press: 1.00000 atm
elementType: 8 8 8 8 7 7 7 6 6 6 6 6 6 6 6 6 6 6 6 6 6 6 6 6 6 6 6 6 1 1 1 1 1 1 1 1 1 1 1 1 1 1 1 1 1 1 1 1 1
symmnumber: 1
zpe: 1010385.5 jmol-1
zpe.correction: 0.384836 hartree
zpe.thermalcorrener: 0.410132 hartree
zpe.thermalcorrenthalpy: 0.411076 hartree
zpe.thermalcorrgfe: 0.323730 hartree
zpe.sumelectzpe: -1275.995053 hartree
zpe.sumelectthermal: -1275.969757 hartree
zpe.sumelectthermalent: -1275.968812 hartree
zpe.sumelectthermalfe: -1276.056158 hartree
dipole: 6.3071 0.0699 0.9964
dipole: 6.3857
quadrupole: -167.7220 -163.9698 -150.5402
quadrupole: -9.9562 -9.3839 -7.0478
quadrupole: -6.9780 -3.2258 10.2038 -9.9562 -9.3839 -7.0478
hfenergy: -1276.3798885 hartree
pointgroup: C01 [X(C21H21N3O4)]
dipole: 0.9544281 2.2169921 -0.6969928 debye
polarizability: 204.42992|13.1595169|282.507926|0.630415|-22.9884326|236.0227838 unknown
InChI: InChI=1S/C21H21N3O4/c25-20(26)19(23-21(27)28-14-17-9-5-2-6-10-17)11-18-13-24(15-22-18)12-16-7-3-1-4-8-16/h1-10,13,15,19,23,25H,11-12,14H2
charge 0 multiplicity 1
49 atoms
O  1.872207 -1.889564 -0.747211
O  -2.378407 -3.082122 -1.765698
O  -3.511044 -4.273505 -0.120939
O  1.452923 -3.05803 1.267366
N  -1.628381 1.128403 0.826756
N  -0.175417 -2.819606 -0.40443
N  -3.014643 -0.636824 0.506753
C  -1.672229 -2.495796 1.612524
C  -1.27148 -3.395959 0.380149
C  -1.879767 -1.060554 1.229764
C  -1.07252 2.493682 0.737667
C  -1.01642 0.021072 1.430647
C  -2.829086 0.679374 0.282685
C  -0.776467 2.934036 -0.694579
C  -2.499797 -3.645274 -0.48866
C  -1.128874 4.235794 -1.124768
C  -0.114129 2.062573 -1.59642
C  1.065021 -2.634881 0.142795
C  -0.819694 4.66772 -2.435587
C  0.18939 2.490716 -2.906723
C  3.211292 -1.496009 -0.195985
C  -0.159815 3.795478 -3.330346
C  3.116336 -0.241327 0.649324
C  3.169478 1.039905 0.043454
C  2.957704 -0.332209 2.05738
C  3.060997 2.212035 0.825431
C  2.854568 0.838529 2.842329
C  2.905279 2.113586 2.228638
H  -2.588193 -2.928042 2.052915
H  -0.854507 -2.579358 2.347391
H  -0.96159 -4.376013 0.790104
H  -0.140414 2.496821 1.33286
H  -1.770759 3.205953 1.215453
H  -0.048557 0.090756 1.921837
H  -3.5091 1.332488 -0.259044
H  -0.396808 -2.404364 -1.311571
H  -1.649811 4.913667 -0.436644
H  0.156742 1.050247 -1.273524
H  -1.100111 5.676546 -2.758519
H  0.694869 1.807593 -3.598615
H  3.811335 -1.335553 -1.105547
H  3.608017 -2.346669 0.383918
H  0.075016 4.125863 -4.348316
H  -3.237243 -3.18148 -2.255764
H  3.290328 1.120498 -1.04395
H  2.897271 -1.322717 2.520931
H  3.103558 3.1950 0.343333
H  2.740974 0.757587 3.929261
H  2.835656 3.021431 2.838973
