program: Gaussian 09
title: 000297816
version: EM64L-G09RevD.01
frameworkgroup: C1[X(C16H22N2O5S)]
method: RPBEPBE
basis: SDD
operation: Freq
keyword: #p
keyword: freq=noraman
keyword: PBEPBE/SDD
title: #p freq=noraman PBEPBE/SDD
converged: YES YES NO NO
title: Mulliken charges:
elementType: S O O O O O N N C C C C C C C C C C C C C C C C H H H H H H H H H H H H H H H H H H H H H H
charge: 0.154451 -0.257447 -0.233196 -0.278046 -0.284354 -0.324425 -0.394820 -0.360245 -0.147513 -0.331436 -0.724094 0.177989 0.232936 -0.526258 -0.836032 -0.484426 0.465909 0.338196 -0.498931 -0.383790 -0.390009 -0.230662 -0.197049 -0.246499 0.295590 0.243839 0.254050 0.279166 0.263005 0.389776 0.254609 0.256550 0.334694 0.275176 0.257317 0.247278 0.224770 0.249153 0.238250 0.242285 0.245738 0.234414 0.271797 0.229570 0.236087 0.236637
chargesum: 0.00000
title: Mulliken charges with hydrogens summed into heavy atoms:
elementType: S O O O O O N N C C C C C C C C C C C C C C C C
charge: 0.154451 -0.257447 -0.233196 -0.278046 -0.284354 -0.324425 -0.005044 -0.025551 0.148077 0.166454 -0.181923 0.177989 0.232936 -0.015100 -0.056262 -0.010503 0.465909 0.338196 0.227342 -0.149376 -0.118212 -0.001092 0.039037 -0.009862
polarizability: 2.34927680e+02 -1.14126880e+00 2.22596125e+02 1.82306296e+01 4.32816809e+00 1.77921467e+02
1716.lowfreq: -13.2155 -0.0012 -0.0005 -0.0005 2.6401 4.6015 10.7262 19.9629 24.2285
frequency: -9.3530 19.7167 24.1944 36.7337 38.5976 47.0783 59.6751 65.4853 78.6500 82.8813 88.4880 92.0813 95.6059 107.7695 123.9642 149.5796 164.2752 170.7628 183.7827 211.6852 224.9596 229.0814 266.1058 275.5443 286.5877 310.9481 321.7175 342.8593 380.0896 405.2105 443.0439 451.6892 494.8991 531.5059 539.6587 581.8846 595.7383 616.9660 631.2563 644.6351 653.2723 686.5517 697.4740 705.2858 745.0829 749.3448 755.3331 765.6567 772.8536 814.9125 822.9636 840.9397 859.7008 885.0514 909.7900 936.9686 939.5942 944.3596 969.8581 971.5971 981.2487 983.2559 990.0986 999.0608 1002.0140 1027.6336 1037.2239 1072.9683 1090.4134 1101.3540 1114.2200 1121.8752 1148.4521 1152.2966 1174.9893 1180.3802 1189.3024 1204.9957 1222.2804 1223.5780 1237.0886 1243.2565 1273.5286 1278.7161 1288.3569 1330.7000 1331.0157 1343.7086 1345.7326 1348.0100 1350.7341 1385.3650 1424.5737 1440.7170 1441.2565 1444.0920 1450.1690 1453.7166 1459.8088 1462.2479 1463.0713 1464.4953 1482.3972 1485.7757 1504.9429 1593.6948 1606.2974 1613.0600 1638.1867 1640.6815 3003.3530 3007.4554 3009.0111 3016.7225 3017.9452 3025.9949 3039.5419 3070.5168 3094.5285 3110.5497 3113.1179 3113.2477 3119.5481 3120.8224 3129.1775 3131.5223 3139.2144 3152.6257 3154.5425 3169.3454 3396.7990 3580.1255
redmass: 4.8803 5.3538 6.0084 5.0723 5.9386 6.8190 5.1098 3.9982 3.4987 4.3308 3.2332 1.5102 2.3369 4.2340 1.3763 4.3396 3.8946 4.8879 4.0515 3.3302 5.9604 4.0961 6.2015 4.6372 3.4955 4.1371 4.4293 2.9513 2.8787 2.8354 4.4489 3.7820 4.5927 3.1750 1.2738 5.0745 4.2285 6.2545 5.3485 4.9751 5.1703 5.8372 8.0412 1.8925 3.6974 1.4919 1.2651 2.6435 2.8115 3.6021 3.7247 4.4853 1.2517 3.8559 4.2764 1.7792 1.8829 3.3653 1.2359 1.6999 1.9148 1.3919 5.7243 2.6517 1.3344 2.2189 1.9662 3.1037 1.5357 4.7514 1.2656 2.9902 2.2087 1.7919 1.0561 1.2784 1.1218 1.8419 1.3858 2.6776 1.1971 1.7630 1.3142 1.3288 1.1517 1.3241 1.4498 1.1618 1.3305 1.2504 1.3771 8.0336 1.1905 1.1307 1.8379 1.1821 1.0658 1.0499 1.0657 1.1422 1.0569 1.0743 1.9575 2.1080 2.0133 6.0771 8.1906 6.0444 8.1751 7.4946 1.0288 1.0297 1.0587 1.0671 1.0637 1.0740 1.0586 1.1036 1.1058 1.1048 1.1074 1.1008 1.1056 1.0874 1.1026 1.0877 1.0921 1.0960 1.1050 1.1010 1.0811 1.0782
irintensity: 0.0363 0.1775 0.1913 1.5607 0.5351 2.8695 3.1332 0.5894 0.8960 7.3328 3.7212 2.3175 2.9844 9.0252 1.1456 4.6383 1.6013 6.2028 4.7334 5.6711 2.1568 11.2540 12.9820 9.1140 2.0939 10.1262 7.6263 2.3755 19.9037 0.0101 10.8036 8.2369 12.3311 30.7571 107.6608 22.5087 19.6114 0.3246 2.0063 5.6354 4.5106 4.5869 23.2685 66.9627 55.8403 7.5806 138.6555 43.2339 35.6652 12.5901 8.1181 11.7749 0.8059 6.0597 109.9877 7.2194 1.7970 21.9989 12.0046 7.3757 7.3295 0.4619 0.4955 14.8371 0.0475 2.9261 13.6339 16.1167 7.6316 89.4741 0.2470 27.2552 157.9265 130.1031 0.1590 8.8012 6.4868 166.3468 14.2740 23.1268 0.4483 105.2791 35.4587 20.6505 0.2032 9.6679 32.7074 4.9195 8.9817 13.4788 14.6226 0.6948 19.9414 35.4151 8.8658 0.4915 7.6807 14.1131 5.0555 14.2262 12.0732 26.3979 171.5508 96.8136 265.9717 2.0893 154.3899 0.5657 281.8914 99.2937 20.5194 33.8215 7.3034 16.9259 22.1181 13.2836 35.0597 0.0734 25.5848 24.0452 4.4387 6.0630 15.8222 6.1973 9.7315 1.4096 8.9296 31.2229 13.1297 13.7491 133.4313 46.7707
temp: 298.150 k
press: 1.00000 atm
elementType: 16 8 8 8 8 8 7 7 6 6 6 6 6 6 6 6 6 6 6 6 6 6 6 6 1 1 1 1 1 1 1 1 1 1 1 1 1 1 1 1 1 1 1 1 1 1
symmnumber: 1
zpe: 959409.4 jmol-1
zpe.correction: 0.365420 hartree
zpe.thermalcorrener: 0.390828 hartree
zpe.thermalcorrenthalpy: 0.391772 hartree
zpe.thermalcorrgfe: 0.306711 hartree
zpe.sumelectzpe: -1504.791821 hartree
zpe.sumelectthermal: -1504.766413 hartree
zpe.sumelectthermalent: -1504.765469 hartree
zpe.sumelectthermalfe: -1504.850529 hartree
dipole: 1.7624 0.0075 -0.7725
dipole: 1.9243
quadrupole: -130.5506 -143.4453 -156.6549
quadrupole: 9.4639 16.3005 4.9681
quadrupole: 12.9997 0.1050 -13.1046 9.4639 16.3005 4.9681
hfenergy: -1505.1572409 hartree
pointgroup: C01 [X(C16H22N2O5S1)]
dipole: -0.6557864 -0.0609889 0.373338 debye
polarizability: 238.228665|-1.617191|222.5980821|11.4313641|4.4646355|174.6185251 unknown
InChI: InChI=1S/C16H22N2O5S/c1-22-15(20)13(8-9-24-2)18-14(19)10-17-16(21)23-11-12-6-4-3-5-7-12/h3-7,13,17-18H,8-11H2,1-2H3
charge 0 multiplicity 1
46 atoms
S  0.205632 -2.903759 -1.939503
O  4.597912 -1.363697 0.162741
O  3.22668 -0.373786 1.766134
O  2.281281 2.459148 -2.135102
O  -2.312817 2.202628 0.858532
O  -0.162238 1.755171 1.736884
N  2.052052 1.234136 -0.164648
N  -0.479486 3.072411 -0.169808
C  2.927906 0.156091 -0.63802
C  2.19433 -0.888036 -1.545453
C  1.143087 -1.721436 -0.796069
C  3.571989 -0.519518 0.571068
C  1.810209 2.331562 -0.960678
C  0.940018 3.431008 -0.307106
C  -1.016462 -1.680846 -2.690302
C  -2.922154 1.298371 1.899763
C  -3.108273 -0.104184 1.367068
C  -0.917266 2.294643 0.874605
C  5.286476 -2.115503 1.24279
C  -4.309613 -0.46722 0.706843
C  -2.07919 -1.07108 1.514325
C  -4.479561 -1.772372 0.192689
C  -2.246326 -2.374942 0.997011
C  -3.445957 -2.727548 0.334665
H  3.721218 0.610053 -1.26142
H  2.953623 -1.556944 -1.987984
H  1.73055 -0.318364 -2.370808
H  0.394892 -1.086487 -0.290177
H  1.61006 -2.376083 -0.038889
H  1.637822 1.181534 0.779234
H  1.018208 4.322707 -0.947861
H  1.340673 3.669379 0.695191
H  -1.163112 3.398444 -0.85295
H  -1.681597 -1.287407 -1.904887
H  -0.481596 -0.862126 -3.197224
H  -1.606797 -2.244751 -3.429471
H  -3.883118 1.791088 2.114997
H  -2.266458 1.320911 2.786586
H  6.025801 -2.737936 0.720744
H  4.562669 -2.734508 1.798753
H  5.775108 -1.413926 1.939122
H  -5.10996 0.274584 0.593673
H  -1.152047 -0.791266 2.028323
H  -5.412265 -2.044245 -0.31402
H  -1.444207 -3.113323 1.097495
H  -3.570494 -3.738575 -0.068355
