program: Gaussian 09
title: 000297782
version: EM64L-G09RevD.01
frameworkgroup: C1[X(C12H14ClNO3)]
method: RPBEPBE
basis: SDD
operation: Freq
keyword: #p
keyword: freq=noraman
keyword: PBEPBE/SDD
title: #p freq=noraman PBEPBE/SDD
converged: YES YES NO NO
title: Mulliken charges:
elementType: Cl O O O N C C C C C C C C C C C C H H H H H H H H H H H H H H
charge: -0.038216 -0.290505 -0.448710 -0.264882 -0.373013 0.549954 -0.522317 -0.502184 -0.472591 0.241817 0.169107 -0.351673 0.184813 0.385322 -0.777997 -0.520517 -0.594898 0.266903 0.229565 0.272054 0.235152 0.314942 0.216077 0.272070 0.236565 0.238112 0.360929 0.213237 0.263490 0.231217 0.276178
chargesum: 0.00000
title: Mulliken charges with hydrogens summed into heavy atoms:
elementType: Cl O O O N C C C C C C C C C C C C
charge: -0.038216 -0.290505 -0.087781 -0.264882 -0.058072 0.549954 -0.025849 -0.230130 -0.237439 0.241817 0.169107 -0.135596 0.184813 0.385322 -0.031249 0.187426 -0.318720
polarizability: 2.07969914e+02 3.05009632e+00 1.56816699e+02 2.13684161e+00 9.61975534e+00 1.24141118e+02
1716.lowfreq: -9.4062 -5.7591 -0.9294 -0.0014 -0.0010 0.0012 6.0091 18.6965 29.1745
frequency: 5.6593 18.6196 29.1563 52.8800 71.4198 102.5298 115.8847 121.6283 125.6537 157.7863 195.5071 214.8259 239.1678 260.4421 270.1896 316.8343 319.8821 338.4454 344.7625 361.0155 401.6660 441.9654 461.2285 505.9718 531.4367 568.4952 597.6094 633.4585 649.1236 694.3974 709.2148 722.2507 749.8893 763.6564 795.4677 820.4032 839.0525 888.1324 900.7996 920.1557 969.2863 995.7606 1015.0489 1044.6950 1052.6286 1080.2437 1112.7223 1137.9527 1152.1957 1161.4489 1164.0183 1222.0131 1230.6764 1235.5854 1267.7315 1284.3149 1298.7663 1350.8109 1392.6118 1393.8172 1413.1322 1440.6826 1455.8607 1456.4251 1463.5703 1472.2411 1479.5976 1480.1688 1502.6299 1591.9687 1597.2922 1616.8519 1629.7933 2978.9196 2984.1981 2987.5646 3043.4921 3071.8374 3089.0027 3109.0252 3118.0287 3131.2201 3141.6957 3155.5198 3186.6204 3546.6862 3578.7926
redmass: 5.4227 4.8214 7.0744 2.0428 4.3082 5.6019 1.1342 1.7323 4.0319 2.9483 5.1961 3.9382 4.9018 4.6419 4.5698 3.3293 3.6471 1.3521 4.1258 3.6594 4.2294 4.0222 3.2611 5.0577 3.3814 4.6930 1.2517 4.4628 3.9791 4.8315 5.5251 3.6681 4.8052 4.2627 1.5228 1.5593 3.7720 2.5911 2.1019 1.3580 2.5830 3.6430 1.9186 1.6614 2.3889 2.2875 1.2388 2.1752 1.3855 1.3095 1.7240 1.3804 1.7427 1.6121 3.6577 1.3935 1.7255 1.5659 1.3459 4.6051 1.9773 1.4445 1.0691 1.0540 1.0848 1.3291 1.2986 1.1553 2.9763 7.0268 6.7377 6.7177 7.0518 1.0346 1.0616 1.0389 1.0997 1.0940 1.0973 1.0881 1.1003 1.1049 1.0953 1.0919 1.0952 1.0776 1.0660
irintensity: 1.4381 0.5354 0.5977 6.2029 5.1305 0.9766 0.4571 4.0539 4.0800 3.8257 0.7185 8.9349 5.9548 3.5112 3.3107 13.3208 7.4316 104.9734 16.6194 11.8893 10.3488 1.7426 22.3035 7.9771 6.4124 10.7387 150.3188 17.3730 1.1786 24.2676 16.1137 0.4028 33.0995 38.7780 40.3274 26.8081 4.2991 12.9530 35.6372 2.2596 23.7584 45.0095 12.8235 2.8789 11.6941 146.8979 5.8035 45.3082 29.0279 19.3236 66.5527 22.6695 17.6620 138.7975 221.4415 5.8439 55.1878 15.7344 41.7892 3.3389 37.8649 15.6012 34.5586 24.3333 4.5457 138.4213 91.5727 74.8103 104.1084 140.3686 54.9392 5.4719 82.2118 82.5304 40.2628 8.1526 10.6391 10.0143 34.6949 19.0590 6.5742 14.3343 15.2729 0.7002 7.5194 18.4760 40.9272
temp: 298.150 k
press: 1.00000 atm
elementType: 17 8 8 8 7 6 6 6 6 6 6 6 6 6 6 6 6 1 1 1 1 1 1 1 1 1 1 1 1 1 1
symmnumber: 1
zpe: 625298.9 jmol-1
zpe.correction: 0.238164 hartree
zpe.thermalcorrener: 0.256437 hartree
zpe.thermalcorrenthalpy: 0.257382 hartree
zpe.thermalcorrgfe: 0.187497 hartree
zpe.sumelectzpe: -1204.864996 hartree
zpe.sumelectthermal: -1204.846723 hartree
zpe.sumelectthermalent: -1204.845778 hartree
zpe.sumelectthermalfe: -1204.915663 hartree
dipole: -4.3704 -2.3259 -2.0593
dipole: 5.3620
quadrupole: -96.0565 -96.4349 -117.1319
quadrupole: 6.0306 0.4417 7.1609
quadrupole: 7.1513 6.7729 -13.9241 6.0306 0.4417 7.1609
hfenergy: -1205.1031601 hartree
pointgroup: C01 [X(C12H14Cl1N1O3)]
dipole: 1.8201959 -1.016964 0.3208098 debye
polarizability: 208.1557997|1.0928128|157.0792441|2.0591415|8.7556192|123.6926869 unknown
InChI: InChI=1S/C12H14ClNO3/c1-8(6-13)12(16)14-7-9-3-4-10(15)11(5-9)17-2/h3-6,14-15H,7H2,1-2H3
charge 0 multiplicity 1
31 atoms
Cl -5.6744 -1.333317 1.75353
O  2.310302 1.670401 1.486325
O  4.475066 -0.241711 1.514296
O  -2.576307 0.511937 -1.953538
N  -1.613175 -1.083136 -0.546845
C  0.881931 -1.027797 -0.625426
C  -0.414801 -1.287164 -1.382205
C  1.074359 0.190254 0.070539
C  1.925592 -1.982133 -0.627521
C  2.269806 0.467348 0.766888
C  3.308028 -0.51272 0.770623
C  3.130531 -1.720643 0.061046
C  -2.624308 -0.20264 -0.903756
C  -3.804309 -0.122306 0.047817
C  -4.439586 1.239683 0.179863
C  3.521766 2.5127 1.382993
C  -4.244681 -1.266172 0.630703
H  -0.530106 -0.592886 -2.235747
H  -0.41022 -2.317041 -1.789663
H  0.293255 0.957801 0.083783
H  1.803248 -2.929941 -1.164053
H  -1.632106 -1.507264 0.382624
H  3.932759 -2.470996 0.064308
H  -4.521254 1.6928 -0.823281
H  -5.434132 1.185718 0.649412
H  -3.802212 1.911229 0.786314
H  5.09503 -1.011707 1.475257
H  3.705441 2.792105 0.327654
H  4.402429 1.995396 1.795019
H  3.285522 3.412111 1.971388
H  -3.832568 -2.263309 0.461152
