program: Gaussian 09
title: 000297823
version: EM64L-G09RevD.01
frameworkgroup: C1[X(C23H29N3O4S)]
method: RPBEPBE
basis: SDD
operation: Freq
keyword: #p
keyword: freq=noraman
keyword: PBEPBE/SDD
title: #p freq=noraman PBEPBE/SDD
converged: YES YES NO NO
title: Mulliken charges:
elementType: S O O O O N N N C C C C C C C C C C C C C C C C C C C C C C C H H H H H H H H H H H H H H H H H H H H H H H H H H H H H
charge: 0.179566 -0.316853 -0.285797 -0.278993 -0.317256 -0.369461 -0.379921 -0.613901 -0.114529 -0.149688 -0.204822 -0.739494 -0.703888 0.247553 0.212792 -0.672792 -0.830117 0.309115 0.486255 -0.476967 -0.446261 -0.353327 0.467499 -0.236029 -0.224412 -0.238922 -0.382638 -0.369515 -0.225538 -0.227055 -0.232509 0.235095 0.278133 0.316523 0.275101 0.172818 0.229131 0.280650 0.208055 0.223413 0.221033 0.320285 0.233875 0.370794 0.337310 0.373753 0.265244 0.273768 0.240797 0.220642 0.294051 0.245224 0.233708 0.226131 0.228591 0.233237 0.269296 0.226413 0.226331 0.228502
chargesum: 0.00000
title: Mulliken charges with hydrogens summed into heavy atoms:
elementType: S O O O O N N N C C C C C C C C C C C C C C C C C C C C C C C
charge: 0.179566 -0.316853 -0.285797 -0.278993 -0.317256 -0.052937 -0.009128 0.097163 0.120566 0.128445 0.070279 -0.056895 -0.051387 0.247553 0.212792 -0.118632 -0.291105 0.309115 0.486255 -0.015528 -0.152210 -0.108103 0.467499 -0.002320 0.001719 -0.010332 -0.149401 -0.100219 0.000875 -0.000723 -0.004008
polarizability: 3.29151131e+02 -7.22923821e+00 3.18326038e+02 -1.36827621e+00 1.26464177e+01 2.37315136e+02
1716.lowfreq: -10.8214 -5.3353 0.0003 0.0013 0.0015 4.1400 9.5927 14.9787 20.0212
frequency: 9.4468 13.2041 19.6931 29.3306 32.6738 35.5867 40.9545 46.8159 54.4424 65.0029 70.9429 76.4902 81.5825 87.3196 107.8431 119.6329 124.5753 142.7231 152.3246 173.2957 184.4228 206.7364 216.8759 238.7677 243.9471 259.1005 270.5747 276.8094 301.6133 317.2616 320.8723 328.7264 340.0760 354.2000 392.4242 403.7891 406.8140 423.6871 458.2506 472.5345 490.3785 533.8683 545.5544 556.9177 587.5338 592.0064 594.9857 610.8975 614.6838 617.9950 626.2884 629.4334 654.8835 663.1752 670.8659 701.6054 705.2689 709.0879 724.7942 751.2237 758.3150 767.2663 772.9354 805.0315 815.8988 823.7173 856.6429 861.0078 862.8871 872.1099 884.6784 893.0766 913.1921 920.5212 934.0793 939.9866 952.8122 960.6122 975.3293 980.9062 986.7849 988.5211 990.1229 991.9186 999.2001 1006.0474 1008.6749 1020.9524 1027.2440 1027.8769 1074.3723 1090.9391 1093.9129 1116.4866 1126.0225 1129.5251 1148.6305 1172.6036 1173.1737 1174.3929 1188.9558 1192.0925 1194.3578 1208.6637 1214.4655 1219.9176 1221.7553 1226.2344 1239.0241 1245.0672 1255.3426 1292.1783 1309.4955 1321.9544 1330.6494 1332.2553 1334.1148 1343.1342 1352.9920 1361.6776 1375.5963 1382.8924 1386.1320 1395.8354 1438.4790 1442.5119 1448.4104 1456.7959 1458.8440 1463.6623 1468.5987 1474.6817 1480.6831 1485.5666 1485.7719 1490.4397 1503.2349 1576.9654 1591.8100 1595.0079 1612.2046 1615.3326 1616.0693 1636.8264 1640.3931 2957.3341 2959.3518 2974.5910 3008.6150 3012.3919 3014.8118 3020.2195 3036.2960 3055.5859 3069.6494 3077.4461 3086.7996 3101.5996 3103.5167 3109.7011 3110.1523 3120.0518 3122.0427 3127.5165 3132.3947 3140.1649 3145.1479 3151.3538 3162.0816 3164.6871 3382.8423 3500.1923 3540.2874 3599.9701
redmass: 6.0507 4.3432 4.6931 5.4169 5.2567 4.6463 4.1742 4.3208 3.5882 5.1009 5.5890 4.6638 6.7623 9.5840 5.0842 6.2961 4.5787 6.0713 6.0911 5.9765 4.6169 1.2036 3.1305 2.0875 2.2565 3.3742 3.9100 3.7841 4.9560 4.6016 2.5920 2.8790 3.1218 3.0255 3.1482 2.8046 2.8631 2.6135 4.4497 3.6743 4.3704 2.4721 2.6961 5.0234 1.7651 2.5600 3.2889 3.7503 6.0660 6.0104 1.7701 4.2914 4.0948 1.5557 2.7690 3.0006 3.1037 1.7587 3.2351 1.2460 2.0723 3.2004 2.5355 3.7798 3.4927 3.5572 1.3005 2.4244 1.4243 3.1209 2.8270 1.4518 1.2523 3.4962 1.5500 1.4347 2.8372 1.5199 1.9510 1.4291 1.6787 3.3370 4.8625 2.1354 1.3659 1.3122 3.4695 2.1311 2.2239 2.2151 1.5246 1.5174 1.9983 1.6867 1.9263 1.1233 2.2030 1.0532 1.0604 1.6410 1.1208 1.8376 1.1629 1.4794 1.7929 2.0267 2.8069 1.9798 1.1628 1.3760 1.3182 1.4017 1.6489 1.4439 1.2618 1.3544 1.2660 1.6225 1.3710 2.0192 1.2119 8.2296 8.0585 1.2142 2.0732 2.1752 1.0989 1.3565 1.3100 1.2496 1.2147 1.0694 1.3848 2.2305 2.2549 1.1303 1.3121 3.1848 5.9294 6.0990 5.9090 5.9503 2.6638 5.8518 2.6700 1.0813 1.0445 1.0363 1.0833 1.0567 1.0838 1.0611 1.0586 1.0912 1.0982 1.0993 1.1082 1.1030 1.0997 1.0912 1.1072 1.0862 1.0858 1.0875 1.0909 1.0922 1.0958 1.0963 1.1014 1.1016 1.0565 1.0774 1.0771 1.0958
irintensity: 0.0979 0.1720 0.1567 0.3237 0.1099 0.2977 0.1235 0.0466 0.2874 2.5662 0.8628 1.6477 6.0947 8.2743 1.6231 6.4247 4.6876 0.1386 2.3077 4.3082 8.4633 1.9213 10.5838 13.9821 0.6000 14.0893 1.5706 3.7803 4.5096 9.0107 1.1794 0.3184 9.3298 11.6482 4.6415 0.0507 0.1629 4.2650 9.6488 5.0018 7.8163 12.6503 20.2553 0.3042 83.5666 20.7074 57.2377 29.7618 6.2302 1.6605 68.5385 4.4726 17.5121 76.8350 36.6900 20.5464 83.5334 64.2865 75.6068 235.1700 53.7773 18.1341 21.2263 5.2903 8.2022 6.8874 0.5510 6.2755 3.0503 2.2795 30.8759 1.0066 13.8978 4.0766 13.6031 3.2095 87.7538 0.1976 7.4255 0.5103 0.4740 0.5732 2.7257 7.1137 1.0625 3.4035 250.6698 8.4139 6.1002 2.9149 7.8560 8.6974 1.0075 53.7762 16.5262 7.5291 0.9505 0.1906 0.5132 41.5124 2.2886 6.8686 0.2989 55.4865 19.2212 31.2175 20.4289 12.5221 16.6844 29.9371 3.4019 23.0818 10.2824 52.5262 0.3062 44.3505 0.7421 30.3093 0.4361 44.5309 34.9492 0.2893 0.6805 22.1486 4.2486 8.6285 24.4817 282.9584 194.2082 254.4107 250.3097 14.4255 34.8355 25.1132 12.7522 12.9329 62.6034 143.7368 1.9998 1.7709 2.9246 1.1295 111.9600 262.9721 184.3290 22.0816 30.3394 28.0402 4.7108 17.2885 8.6691 32.3822 41.3437 26.3811 62.2507 39.9865 12.4079 5.1918 11.4024 6.1807 6.2508 4.5656 2.2463 2.0208 5.5040 20.4708 28.5579 25.8574 33.8943 21.0996 111.9057 127.9715 37.1546 48.8179
temp: 298.150 k
press: 1.00000 atm
elementType: 16 8 8 8 8 7 7 7 6 6 6 6 6 6 6 6 6 6 6 6 6 6 6 6 6 6 6 6 6 6 6 1 1 1 1 1 1 1 1 1 1 1 1 1 1 1 1 1 1 1 1 1 1 1 1 1 1 1 1 1
symmnumber: 1
zpe: 1275668.3 jmol-1
zpe.correction: 0.485876 hartree
zpe.thermalcorrener: 0.517738 hartree
zpe.thermalcorrenthalpy: 0.518682 hartree
zpe.thermalcorrgfe: 0.416784 hartree
zpe.sumelectzpe: -1754.810207 hartree
zpe.sumelectthermal: -1754.778346 hartree
zpe.sumelectthermalent: -1754.777401 hartree
zpe.sumelectthermalfe: -1754.879299 hartree
dipole: 0.4510 -0.9664 -0.9588
dipole: 1.4341
quadrupole: -193.6525 -176.0679 -185.5418
quadrupole: -13.6661 -5.0560 3.5164
quadrupole: -8.5651 9.0195 -0.4544 -13.6661 -5.0560 3.5164
hfenergy: -1755.2960833 hartree
pointgroup: C01 [X(C23H29N3O4S1)]
dipole: 0.1711209 -0.3261733 -0.4273864 debye
polarizability: 328.7655869|-7.5554395|313.3792117|-1.1652008|23.7749943|242.6475068 unknown
InChI: InChI=1S/C23H29N3O4S/c1-16(2)20(21(24)27)26-22(28)19(15-31-14-18-11-7-4-8-12-18)25-23(29)30-13-17-9-5-3-6-10-17/h3-12,16,19-20,25-26H,13-15,24H2,1-2H3
charge 0 multiplicity 1
60 atoms
S  0.343979 1.019758 -0.137439
O  0.820276 -2.287416 1.464295
O  5.003609 -0.625274 0.522474
O  -3.657311 -1.923151 0.689798
O  -2.986335 -1.777582 -1.574831
N  2.145421 -2.219225 -0.439124
N  -1.446557 -1.767998 0.18696
N  3.2394 -0.82132 2.029015
C  4.434089 -3.219675 -0.673603
C  3.410122 -2.532533 0.269877
C  -0.270059 -1.734313 -0.677202
C  4.677318 -2.443436 -1.992367
C  4.018157 -4.683382 -0.952878
C  0.94263 -2.105092 0.205677
C  3.97143 -1.236919 0.944007
C  -0.088381 -0.356903 -1.374068
C  1.94853 1.679594 -0.969235
C  -2.711368 -1.813255 -0.340512
C  2.546633 2.789417 -0.135033
C  -5.094919 -1.898003 0.249293
C  3.792283 2.602352 0.519671
C  1.87916 4.036228 -0.005547
C  -5.639086 -0.487161 0.182882
C  4.360328 3.648116 1.283974
C  2.444751 5.076334 0.763407
C  3.688859 4.88565 1.410872
C  -6.258237 0.098515 1.316214
C  -5.53754 0.265692 -1.015879
C  -6.764367 1.416136 1.25736
C  -6.043611 1.582892 -1.076128
C  -6.658185 2.161076 0.059607
H  5.391181 -3.219462 -0.117649
H  3.14086 -3.230888 1.085952
H  2.205841 -2.019619 -1.439671
H  -0.390858 -2.491889 -1.481358
H  3.802693 -2.484276 -2.674788
H  5.515856 -2.90373 -2.544712
H  4.940123 -1.393108 -1.786003
H  3.038492 -4.732287 -1.4655
H  4.761273 -5.179305 -1.603325
H  3.939868 -5.269934 -0.018783
H  -1.029703 -0.098872 -1.883849
H  0.717208 -0.395221 -2.129964
H  -1.282648 -1.85805 1.19555
H  3.482691 0.065052 2.474341
H  2.35351 -1.290033 2.264813
H  2.64899 0.833591 -1.065546
H  1.65122 2.034667 -1.971035
H  -5.156401 -2.404778 -0.729164
H  -5.596152 -2.495399 1.0270
H  4.328667 1.649684 0.418741
H  0.912771 4.183784 -0.502488
H  5.32863 3.495145 1.773995
H  1.919484 6.033643 0.856554
H  4.129986 5.694395 2.004451
H  -6.339225 -0.47808 2.246047
H  -5.047815 -0.185207 -1.886238
H  -7.241044 1.859682 2.138707
H  -5.960777 2.157209 -2.005687
H  -7.051938 3.18276 0.011877
