program: Gaussian 09
title: 000297766
version: EM64L-G09RevD.01
frameworkgroup: C1[X(C10H13N3O2)]
method: RPBEPBE
basis: SDD
operation: Freq
keyword: #p
keyword: freq=noraman
keyword: PBEPBE/SDD
title: #p freq=noraman PBEPBE/SDD
converged: YES YES NO NO
title: Mulliken charges:
elementType: O O N N N C C C C C C C C C C H H H H H H H H H H H H H
charge: -0.517559 -0.269336 -0.078837 -0.434569 0.001610 0.088285 0.253736 -0.317382 0.175124 -0.391079 -0.246385 -0.204347 -0.618569 -0.594085 -0.143041 0.284667 0.213313 0.232890 0.230477 0.227561 0.209923 0.290139 0.226362 0.219093 0.229751 0.200100 0.358692 0.373467
chargesum: 0.00000
title: Mulliken charges with hydrogens summed into heavy atoms:
elementType: O O N N N C C C C C C C C C C
charge: -0.144091 -0.269336 -0.078837 -0.075877 0.001610 0.088285 0.253736 -0.032715 0.175124 -0.177767 -0.013495 0.026130 0.109054 0.081121 0.057059
polarizability: 2.77393002e+02 1.24684577e+01 1.44440903e+02 3.09698494e-01 -1.15406216e+00 6.47979706e+01
1716.lowfreq: -1.5934 0.0000 0.0004 0.0006 4.2284 8.1074 31.1435 40.0025 61.6453
frequency: 31.1058 39.8989 61.6369 66.5900 92.7724 118.7807 137.2048 174.9284 189.3060 236.1699 250.4120 275.7411 296.6701 321.0302 358.0230 362.3554 387.9374 438.9709 445.9093 512.0259 525.7375 537.0651 599.7462 660.4961 661.6037 728.3740 745.6064 762.2687 792.9839 846.0971 854.4056 888.5155 904.4245 954.6041 1002.7030 1020.6619 1044.5547 1060.5752 1069.6003 1093.1800 1099.7646 1136.8194 1143.8333 1152.7329 1170.4834 1208.0431 1242.1737 1254.7649 1288.9165 1343.4531 1385.9086 1390.6152 1423.7863 1431.5231 1440.3224 1457.1590 1463.9411 1478.0715 1486.6787 1501.2318 1552.8519 1577.5286 1608.9863 1619.7264 1636.4291 2935.9748 2955.3322 2996.1645 3024.4007 3042.8263 3081.5053 3108.3725 3112.7722 3139.9656 3153.1594 3169.8275 3326.5083 3591.4130
redmass: 3.0302 4.4995 3.8688 1.8337 2.4810 1.4074 3.8545 3.6066 1.8960 3.9342 4.6240 3.4382 5.9266 1.2142 4.4965 6.3409 3.3362 3.5672 3.7063 4.8313 3.8947 7.0294 5.5972 4.7072 5.8032 1.1111 3.8666 1.4181 6.7736 5.2427 1.4188 4.2351 1.5237 1.3457 1.3240 5.6594 2.3855 1.4111 2.7290 1.2386 1.7405 1.5183 2.0130 1.2769 1.0615 2.8398 3.3752 2.9826 1.4729 1.4902 3.4271 7.1263 1.1358 2.3350 1.2064 1.0546 1.0797 2.3746 1.0528 1.1512 1.6775 7.1765 6.2544 5.6490 5.1210 1.0438 1.0419 1.0875 1.0901 1.0933 1.0991 1.0890 1.0993 1.0876 1.0929 1.1003 1.0801 1.0661
irintensity: 0.8642 3.0482 3.4091 0.8895 0.1638 2.9131 0.9328 8.1893 2.6029 0.0541 1.4617 40.3945 6.0170 125.1638 8.8560 1.8638 4.2565 5.7977 10.7386 3.1079 12.8592 9.3821 10.1782 17.8101 8.1276 67.7987 37.2447 85.1927 9.6353 9.8596 0.4480 61.2443 51.6337 2.4696 1.7277 3.9356 29.1644 2.5335 95.9799 8.3553 61.4864 90.7982 42.1231 17.6336 6.6943 17.2938 36.4231 34.4445 41.5335 67.3175 38.8186 6.5363 20.3708 14.8594 46.9476 5.8138 46.1448 33.1134 22.8869 7.5696 86.6256 120.3216 130.7641 247.7387 401.6895 146.8825 132.2905 38.5515 48.2435 41.7072 31.6813 13.3213 4.1100 9.4511 3.4784 31.1883 73.1372 33.0986
temp: 298.150 k
press: 1.00000 atm
elementType: 8 8 7 7 7 6 6 6 6 6 6 6 6 6 6 1 1 1 1 1 1 1 1 1 1 1 1 1
symmnumber: 1
zpe: 578302.6 jmol-1
zpe.correction: 0.220264 hartree
zpe.thermalcorrener: 0.235680 hartree
zpe.thermalcorrenthalpy: 0.236624 hartree
zpe.thermalcorrgfe: 0.176345 hartree
zpe.sumelectzpe: -702.416475 hartree
zpe.sumelectthermal: -702.401059 hartree
zpe.sumelectthermalent: -702.400115 hartree
zpe.sumelectthermalfe: -702.460394 hartree
dipole: 1.0993 6.9946 0.0663
dipole: 7.0808
quadrupole: -54.6477 -82.4102 -93.1186
quadrupole: -0.4989 0.9522 0.1748
quadrupole: 22.0778 -5.6847 -16.3931 -0.4989 0.9522 0.1748
hfenergy: -702.6367388 hartree
pointgroup: C01 [X(C10H13N3O2)]
dipole: -0.2380702 0.0685441 2.7747512 debye
polarizability: 273.9030906|-15.5331271|65.9363343|-21.4346371|1.1487584|146.7924506 unknown
InChI: InChI=1S/C10H13N3O2/c1-13(2)7-11-12-10(15)8-5-3-4-6-9(8)14/h3-7,12,14H,1-2H3
charge 0 multiplicity 1
28 atoms
O  1.123951 -0.426622 1.810414
O  -0.074382 -0.273661 -2.312474
N  -4.337609 -0.089853 0.40178
N  -0.771111 -0.258689 -0.069997
N  -2.123095 -0.151277 -0.4052
C  1.62434 -0.413954 -0.586264
C  2.080803 -0.468958 0.760709
C  2.614194 -0.460196 -1.603571
C  0.189131 -0.309627 -1.072536
C  3.455717 -0.563927 1.073855
C  3.988094 -0.554841 -1.309547
C  4.41278 -0.60695 0.0385
C  -4.869561 -0.082918 -0.968403
C  -5.246984 0.270151 1.492903
C  -2.966521 -0.103177 0.608254
H  2.245537 -0.41739 -2.634141
H  3.778134 -0.604164 2.123211
H  4.722056 -0.587722 -2.120916
H  5.477122 -0.680554 0.286174
H  -5.032378 0.949676 -1.341323
H  -5.830552 -0.628197 -0.995235
H  -4.139046 -0.568951 -1.633335
H  -5.556313 1.336717 1.449369
H  -4.759708 0.093502 2.467721
H  -6.15991 -0.352515 1.447785
H  -2.669726 -0.091929 1.674228
H  -0.449423 -0.299194 0.912159
H  1.562661 -0.47868 2.69408
