program: Gaussian 09
title: 000297773
version: EM64L-G09RevD.01
frameworkgroup: C1[X(C14H16N2O2)]
method: RPBEPBE
basis: SDD
operation: Freq
keyword: #p
keyword: freq=noraman
keyword: PBEPBE/SDD
title: #p freq=noraman PBEPBE/SDD
converged: YES YES NO NO
title: Mulliken charges:
elementType: O O N N C C C C C C C C C C C C C C H H H H H H H H H H H H H H H H
charge: -0.297206 -0.291213 -0.441505 -0.388035 0.199712 0.383062 -0.365675 0.186164 -0.405307 -0.383933 -0.433987 -0.230486 -0.229923 -0.238689 0.239863 -0.024714 -0.775083 -0.573621 0.281224 0.264929 0.246063 0.329195 0.365395 0.220283 0.256708 0.230737 0.232951 0.234729 0.231794 0.262777 0.221554 0.261787 0.215281 0.215167
chargesum: 0.00000
title: Mulliken charges with hydrogens summed into heavy atoms:
elementType: O O N N C C C C C C C C C C C C C C
charge: -0.297206 -0.291213 -0.112311 -0.022639 0.199712 0.383062 -0.084450 0.186164 -0.140378 -0.137870 0.043004 0.000251 0.003028 -0.003959 0.239863 0.207080 -0.028966 -0.143173
polarizability: 3.12661835e+02 -2.48480898e+01 1.73128229e+02 1.21236144e+01 -9.48040759e+00 9.72308475e+01
1716.lowfreq: -10.4722 -6.0115 -0.0010 -0.0007 -0.0007 3.7336 10.9691 33.7073 38.9689
frequency: 9.3760 33.6822 38.9120 47.8634 56.8930 70.9004 76.7756 86.9385 114.3715 164.1081 186.3185 198.6128 245.3918 263.5219 285.3305 316.0978 356.9066 367.6314 404.7752 443.9544 468.7093 509.7178 533.0652 561.8202 585.6063 613.3775 648.6689 670.5420 680.6451 692.8111 714.6419 731.0840 767.8369 811.5618 830.3181 858.6877 901.5540 913.1852 916.2420 942.5170 945.6412 965.7452 981.0863 982.0705 988.3202 999.3229 1002.8352 1014.2641 1027.1050 1041.1340 1048.2402 1085.5397 1137.9607 1144.7515 1174.8516 1193.2870 1216.8465 1247.5684 1267.8651 1279.8654 1283.0163 1325.0995 1329.9717 1353.0040 1379.5624 1392.4489 1425.9229 1433.3072 1447.7715 1461.9322 1469.5922 1474.1681 1494.1857 1558.5304 1572.2168 1577.1019 1607.4016 1623.2127 1637.0477 1657.4805 2986.0414 2997.3778 3047.4746 3086.6476 3090.9187 3105.8365 3111.4774 3124.5877 3125.9479 3129.9859 3142.5166 3151.6292 3160.5684 3167.6320 3197.5142 3464.3198
redmass: 3.5732 3.5389 4.8527 4.0786 1.1990 3.9617 2.7891 5.9605 3.0879 3.9387 3.9996 4.5009 5.5610 5.7321 4.5059 4.7736 2.7951 4.5848 2.8522 2.3290 4.3330 3.8091 2.9170 4.4331 3.3257 6.2373 1.9937 4.4866 1.6941 3.3446 1.7225 3.9484 1.8828 4.1075 3.9555 1.2593 1.5381 1.2541 1.2060 1.4934 1.3332 4.3955 1.9927 1.6795 3.1183 1.3414 1.2984 1.7258 2.2595 1.7763 2.8104 1.6503 3.0555 2.0693 1.0600 1.1161 2.1435 1.4720 2.0735 1.2576 2.4241 1.4314 1.2831 2.4257 4.8164 1.2201 1.1923 2.2676 1.0766 1.1046 1.1208 1.9878 2.1251 2.2228 4.1041 4.0335 5.9382 4.9540 3.3985 4.5888 1.0592 1.0367 1.1016 1.0602 1.0989 1.0946 1.0995 1.0877 1.0853 1.0879 1.0920 1.0964 1.0897 1.1016 1.1142 1.0759
irintensity: 0.0856 0.6423 1.5666 0.2992 0.1831 2.3174 2.2628 5.3886 0.8223 2.4006 5.2589 3.4497 2.2205 3.3021 10.5359 9.7037 6.9066 0.0260 0.6762 10.9733 6.2437 17.5258 22.4765 7.4931 3.8766 0.3878 34.5784 0.2886 83.2496 42.5270 5.9589 4.9734 42.0471 0.1306 3.3041 1.7833 7.8617 81.9736 29.7498 20.6518 85.2516 5.9763 9.9120 5.5431 0.8360 0.4569 11.9353 14.9206 8.8587 11.6917 11.0040 8.9547 5.8140 5.6511 0.2236 4.0896 50.2640 81.7285 39.2547 2.9451 65.6869 45.5468 2.2347 56.3458 4.4599 62.0571 16.6401 14.3024 36.6351 22.6654 64.0062 113.8541 219.1524 420.8781 136.4358 59.2072 6.0235 64.7636 73.2589 22.8565 58.2807 6.9133 13.0031 14.2543 12.8623 11.4563 10.4920 2.2251 3.6930 0.0893 9.3800 26.4991 490.8739 28.9219 27.7436 34.7136
temp: 298.150 k
press: 1.00000 atm
elementType: 8 8 7 7 6 6 6 6 6 6 6 6 6 6 6 6 6 6 1 1 1 1 1 1 1 1 1 1 1 1 1 1 1 1
symmnumber: 1
zpe: 714521.7 jmol-1
zpe.correction: 0.272147 hartree
zpe.thermalcorrener: 0.290223 hartree
zpe.thermalcorrenthalpy: 0.291167 hartree
zpe.thermalcorrgfe: 0.222196 hartree
zpe.sumelectzpe: -801.724723 hartree
zpe.sumelectthermal: -801.706647 hartree
zpe.sumelectthermalent: -801.705703 hartree
zpe.sumelectthermalfe: -801.774674 hartree
dipole: 3.7957 3.5619 1.6157
dipole: 5.4503
quadrupole: -92.6936 -107.2598 -107.1235
quadrupole: 0.3907 1.2022 1.7003
quadrupole: 9.6654 -4.9008 -4.7645 0.3907 1.2022 1.7003
hfenergy: -801.9968703 hartree
pointgroup: C01 [X(C14H16N2O2)]
dipole: -1.4023866 1.6153041 0.1487659 debye
polarizability: 312.5303982|3.8562966|143.1713673|29.9433071|36.6525529|127.3191458 unknown
InChI: InChI=1S/C14H16N2O2/c1-3-9-15-14(18)13(16-11(2)17)10-12-7-5-4-6-8-12/h3-8,10,15-16H,1,9H2,2H3
charge 0 multiplicity 1
34 atoms
O  1.275325 -2.246306 -1.009605
O  1.879828 1.331399 1.841842
N  0.033702 0.970206 0.421328
N  2.529399 -0.764816 0.277184
C  0.076733 -0.408841 0.012878
C  -2.485214 -0.544475 -0.213002
C  -1.100605 -1.030881 -0.333714
C  1.3532 -1.201635 -0.277684
C  -2.940786 0.333315 0.818949
C  -3.446135 -1.017794 -1.15659
C  3.797787 -1.477346 0.034802
C  -4.291185 0.739433 0.879222
C  -4.790935 -0.600852 -1.101966
C  -5.220287 0.286642 -0.086389
C  0.825318 1.745319 1.258224
C  4.83247 -0.583109 -0.620868
C  0.357461 3.185371 1.431407
C  6.076869 -0.361434 -0.129734
H  -0.952222 -2.00404 -0.818616
H  -2.254808 0.640904 1.61579
H  -3.120147 -1.711304 -1.940723
H  -0.809408 1.446345 0.080605
H  2.504961 0.022614 0.960005
H  4.19264 -1.873715 0.990321
H  3.554725 -2.337071 -0.617783
H  -4.622795 1.397391 1.690423
H  -5.506171 -0.971839 -1.844217
H  -6.26683 0.606576 -0.038282
H  4.517997 -0.111574 -1.563431
H  0.400963 3.444179 2.501908
H  -0.662279 3.373404 1.053355
H  1.056634 3.858937 0.904293
H  6.798352 0.274422 -0.654454
H  6.410043 -0.814022 0.81302
