program: Gaussian 09
title: 000297749
version: EM64L-G09RevD.01
frameworkgroup: C1[X(C11H14N2)]
method: RPBEPBE
basis: SDD
operation: Freq
keyword: #pfreq=noraman
keyword: PBEPBE/SDD
title: #p freq=noraman PBEPBE/SDD
converged: YES YES NO NO
title: Mulliken charges:
elementType: N N C C C C C C C C C C C H H H H H H H H H H H H H H
charge: -0.014829 -0.012983 -0.177869 -0.190888 -0.080634 -0.531387 -0.142838 -0.477956 -0.471133 -0.490754 -0.224520 -0.431992 -0.161048 0.251633 0.264179 0.258368 0.235951 0.251165 0.250662 0.216346 0.234644 0.239512 0.213678 0.247211 0.230820 0.253360 0.261303
chargesum: 0.00000
title: Mulliken charges with hydrogens summed into heavy atoms:
elementType: N N C C C C C C C C C C C
charge: -0.014829 -0.012983 0.073764 0.073290 0.177735 -0.044272 0.107824 -0.026966 -0.017943 -0.012723 -0.224520 0.082672 -0.161048
polarizability: 1.36260429e+02 5.10393846e+00 1.18454362e+02 6.56529038e+00 1.81551877e+00 9.52387014e+01
1716.lowfreq: -12.6856 -0.0005 -0.0002 0.0004 9.3122 12.5569 37.7989 76.2118 86.0029
frequency: 37.5164 76.1996 85.9615 94.2705 134.0478 177.3040 213.2972 289.0813 322.8963 347.1683 372.2699 411.2813 442.2810 472.8108 517.3671 563.6442 617.3953 726.3130 742.4582 771.7438 803.5444 827.8234 873.7948 887.4470 900.0256 933.4785 934.9045 948.7476 969.7712 995.7454 1011.3832 1014.1291 1031.6152 1055.5613 1071.6237 1088.3033 1123.1291 1141.8258 1153.8470 1174.8647 1190.8918 1208.7180 1218.1142 1241.7604 1268.2030 1275.0087 1278.1339 1282.9880 1295.3878 1302.5281 1310.9197 1332.3404 1338.7476 1352.4747 1451.3037 1465.1727 1471.1724 1481.7788 1498.4793 2184.3728 2199.9017 2987.7908 2989.6321 2997.3351 3002.7152 3003.0774 3013.5016 3015.9639 3037.5502 3053.2625 3058.0327 3063.1503 3076.1408 3084.7149 3086.4910
redmass: 6.0248 3.1979 4.9398 3.2127 5.6169 3.9628 3.7987 2.0722 4.8932 3.1134 3.6071 3.3176 3.0843 3.3279 5.2345 3.9757 4.1986 2.5267 2.8927 2.1552 1.3981 2.2478 3.3196 2.6413 2.4297 3.2729 2.7472 2.4723 1.7597 1.9465 1.8541 2.0053 2.9374 2.1029 1.7464 1.6738 1.2166 1.2901 1.4779 1.5431 1.4555 1.3545 1.4212 1.2418 1.3369 1.2574 1.3193 1.3993 1.4179 1.5615 1.4971 1.4399 1.3457 1.4880 1.0809 1.0849 1.0908 1.0891 1.0895 12.5439 12.4344 1.0767 1.0669 1.0696 1.0706 1.0619 1.0599 1.0629 1.1000 1.1014 1.0915 1.1032 1.1041 1.1040 1.0937
irintensity: 5.0979 4.3385 3.2156 4.3296 5.2272 0.5495 0.6641 0.0524 0.5060 0.1076 0.4263 0.6521 0.6501 0.4921 1.1625 2.7480 3.8754 2.1635 2.2028 4.8409 2.7883 3.4695 2.1365 2.9197 4.5163 0.1530 2.2692 5.1987 1.0503 1.0416 1.0052 0.2351 1.3807 0.7017 3.6508 1.2972 0.8073 0.2446 6.6986 1.2950 0.6300 5.4010 5.0182 1.8377 2.8603 0.4973 2.1178 0.5108 3.2393 3.7848 0.9197 0.4128 6.2873 0.5322 4.8083 9.8939 13.7517 13.4173 10.1585 23.1621 14.2977 6.1588 3.0921 4.4735 45.9865 11.3036 41.0751 38.6829 1.5466 13.6675 40.6732 32.9881 33.0182 33.2588 39.9967
temp: 298.150 k
press: 1.00000 atm
elementType: 7 7 6 6 6 6 6 6 6 6 6 6 6 1 1 1 1 1 1 1 1 1 1 1 1 1 1
symmnumber: 1
zpe: 594990.4 jmol-1
zpe.correction: 0.226620 hartree
zpe.thermalcorrener: 0.238591 hartree
zpe.thermalcorrenthalpy: 0.239535 hartree
zpe.thermalcorrgfe: 0.187605 hartree
zpe.sumelectzpe: -536.068369 hartree
zpe.sumelectthermal: -536.056397 hartree
zpe.sumelectthermalent: -536.055453 hartree
zpe.sumelectthermalfe: -536.107383 hartree
dipole: 2.2946 -4.4752 1.0138
dipole: 5.1304
quadrupole: -109.1142 -89.3647 -74.7266
quadrupole: -9.3637 -7.9032 -0.7269
quadrupole: -18.0457 1.7038 16.3419 -9.3637 -7.9032 -0.7269
hfenergy: -536.2949884 hartree
pointgroup: C01 [X(C11H14N2)]
dipole: -0.8024014 -1.8099739 -0.3927593 debye
polarizability: 136.8030361|-4.0509756|117.9272047|6.5956806|-1.4930826|95.2232521 unknown
InChI: InChI=1S/C11H14N2/c12-5-1-2-10-8-3-4-9(6-8)11(10)7-13/h8-11H,1-4,6H2
charge 0 multiplicity 1
27 atoms
N  -2.535851 2.858652 -0.074262
N  4.83841 0.55967 0.513504
C  -0.41352 -1.15529 -0.946569
C  -2.221954 -0.681901 0.365834
C  -0.072057 0.277831 -0.415883
C  -1.956746 -1.046406 -1.121631
C  -1.302181 0.581229 0.551713
C  -0.303878 -2.20786 0.196462
C  -1.53919 -1.867147 1.111871
C  1.288267 0.47685 0.28247
C  -1.982361 1.840429 0.214051
C  2.480334 0.150715 -0.661389
C  3.787598 0.37596 -0.02134
H  0.147122 -1.424509 -1.857443
H  -3.269178 -0.50391 0.654459
H  -0.122541 0.973638 -1.276958
H  -2.42764 -1.999986 -1.417726
H  -2.26629 -0.2565 -1.828829
H  -0.960252 0.652467 1.602939
H  0.655785 -2.158742 0.740018
H  -0.386103 -3.227565 -0.220234
H  -2.231821 -2.72456 1.181317
H  -1.24575 -1.597157 2.14258
H  1.374839 1.526294 0.6222
H  1.358213 -0.154538 1.1881
H  2.419912 0.775019 -1.574173
H  2.428636 -0.904485 -0.990683
