program: Gaussian 09
title: 000297759
version: EM64L-G09RevD.01
frameworkgroup: C1[X(C13H24N2O)]
method: RPBEPBE
basis: SDD
operation: Freq
keyword: #p
keyword: freq=noraman
keyword: PBEPBE/SDD
title: #p freq=noraman PBEPBE/SDD
converged: NO YES NO NO
title: Mulliken charges:
elementType: O N N C C C C C C C C C C C C C H H H H H H H H H H H H H H H H H H H H H H H H
charge: -0.304927 -0.396519 -0.143785 0.055041 0.329003 -0.516416 -0.488458 -0.037678 -0.497054 -0.459489 -0.745649 -0.755854 -0.748977 0.223385 -0.301757 -0.467801 0.174219 0.194948 0.221625 0.210698 0.211775 0.248291 0.206786 0.215689 0.252417 0.191455 0.209391 0.207074 0.218598 0.213697 0.222758 0.208375 0.216443 0.208625 0.209999 0.320410 0.222634 0.223840 0.223758 0.223427
chargesum: 0.00000
title: Mulliken charges with hydrogens summed into heavy atoms:
elementType: O N N C C C C C C C C C C C C C
charge: -0.304927 -0.076109 -0.143785 0.229260 0.329003 -0.099844 -0.065985 0.210614 -0.074578 -0.015617 -0.110586 -0.111023 -0.113909 0.223385 0.144716 -0.020616
polarizability: 1.89888489e+02 7.40972968e+00 1.35748947e+02 -6.59427372e+00 1.58158073e+00 1.35513099e+02
1716.lowfreq: -30.1639 -5.0627 -0.0007 -0.0005 -0.0004 13.4207 20.9326 25.7036 38.0657
frequency: 12.9463 25.5438 38.0067 50.6629 74.4090 114.8039 157.4319 163.2087 176.2527 219.3093 234.1926 247.0084 254.9550 269.9012 321.7457 328.4412 347.5525 367.5010 373.3021 381.1306 433.9109 439.4105 462.8036 476.8565 514.8310 628.8190 653.0098 708.8527 737.9797 755.8838 777.8061 812.3330 818.3530 832.6014 864.3225 900.3196 912.3229 915.0949 922.2032 927.4019 930.3597 939.8471 941.8241 975.1728 988.5716 1012.4714 1022.7356 1026.1080 1055.6948 1079.7802 1083.5887 1091.5379 1127.2860 1155.6557 1160.0026 1173.8846 1191.8151 1197.6816 1214.7111 1227.0296 1241.3509 1250.4814 1276.5662 1293.7846 1297.5273 1303.3022 1307.9451 1319.5666 1327.9301 1340.9346 1344.5099 1362.2269 1367.5995 1372.6786 1378.0702 1401.2367 1456.2845 1458.4054 1463.3914 1465.5351 1469.5069 1471.3103 1472.0906 1478.1191 1483.6937 1484.6196 1489.4326 1493.7494 1499.0369 1681.4058 2911.3232 2966.9317 2967.0601 2969.9451 2974.4336 2976.8612 2978.4570 2982.3585 2991.5756 3004.4289 3022.5074 3035.4912 3036.0275 3043.4072 3047.4043 3055.4477 3056.7838 3059.6907 3064.8486 3069.7291 3073.9815 3080.4653 3091.9944 3591.7622
redmass: 2.8952 2.8032 2.3724 3.8213 3.5923 3.4794 1.8057 2.3561 2.3951 1.3614 1.7499 1.6830 1.6061 2.4039 2.3847 2.0876 2.3650 2.6129 1.6214 1.3037 2.6373 3.1142 2.2975 2.8346 2.4619 4.4129 5.8096 5.5312 5.2303 3.0375 1.5128 2.7544 1.1726 3.0903 5.5172 2.5977 2.5386 2.5941 1.6746 1.6647 1.6827 1.3349 3.1059 3.6476 2.2299 1.4562 1.7244 2.2184 1.9921 1.8402 1.5694 1.2900 2.1150 1.1124 1.8065 1.4006 2.0901 1.1161 2.1971 2.4987 2.4898 1.4756 1.4785 1.3264 1.3325 1.3060 1.3470 1.5694 1.4681 1.5004 1.3771 1.3623 1.4100 1.2054 1.1991 1.2067 1.1172 1.0577 1.0990 1.0489 1.1980 1.0802 1.1088 1.0971 1.1353 1.1202 1.0960 1.1789 1.0612 9.5207 1.0820 1.0576 1.0379 1.0392 1.0386 1.0661 1.0630 1.0604 1.0583 1.0834 1.0585 1.0969 1.1067 1.0991 1.0970 1.0986 1.0994 1.0991 1.0981 1.0988 1.0980 1.0971 1.1112 1.0771
irintensity: 0.0748 0.3447 2.3646 0.0680 2.9388 2.7693 0.6814 1.7734 1.9385 0.3548 1.4657 0.1566 0.1420 0.4855 0.2810 1.9878 2.3552 19.2685 33.0270 67.0123 0.1765 5.5741 1.4926 1.9437 2.0120 12.0905 8.8842 6.2424 7.7509 1.6837 1.1998 2.3412 0.5622 8.4238 2.6187 18.5470 21.0359 28.6105 1.3001 4.3505 10.6680 2.3315 16.6881 107.9596 11.3956 1.1052 0.9804 6.9781 0.6722 0.4570 0.0350 0.7286 1.6280 0.0593 5.3565 2.4639 10.6782 1.5758 38.9792 9.6770 25.0259 4.6484 4.0800 10.7986 2.2448 3.5082 8.4122 18.7627 0.2510 2.6768 1.0955 2.2400 14.4532 23.1855 28.6234 18.6227 41.9704 1.5917 15.0046 2.2566 48.7797 16.2498 24.4972 3.7250 48.5177 60.2143 3.7572 44.4131 29.8554 521.4948 23.3073 7.2270 29.0714 58.9562 17.1822 11.2079 31.8270 40.3162 78.4868 58.2022 81.3470 39.5534 19.4353 24.2633 57.8824 23.1349 0.9405 39.8319 94.3634 30.4339 56.9876 56.1421 46.5172 48.3439
temp: 298.150 k
press: 1.00000 atm
elementType: 8 7 7 6 6 6 6 6 6 6 6 6 6 6 6 6 1 1 1 1 1 1 1 1 1 1 1 1 1 1 1 1 1 1 1 1 1 1 1 1
symmnumber: 1
zpe: 929225.6 jmol-1
zpe.correction: 0.353923 hartree
zpe.thermalcorrener: 0.371484 hartree
zpe.thermalcorrenthalpy: 0.372428 hartree
zpe.thermalcorrgfe: 0.306682 hartree
zpe.sumelectzpe: -693.211412 hartree
zpe.sumelectthermal: -693.193852 hartree
zpe.sumelectthermalent: -693.192908 hartree
zpe.sumelectthermalfe: -693.258653 hartree
dipole: 0.6398 -0.4021 -0.7787
dipole: 1.0851
quadrupole: -91.9270 -98.0339 -102.5814
quadrupole: 6.4636 1.4291 -2.3568
quadrupole: 5.5871 -0.5198 -5.0673 6.4636 1.4291 -2.3568
hfenergy: -693.5653356 hartree
pointgroup: C01 [X(C13H24N2O1)]
dipole: -0.250359 -0.208785 0.2756193 debye
polarizability: 189.7735731|-6.2370537|136.3032986|-8.1180342|-1.3955836|135.0736632 unknown
InChI: InChI=1S/C13H24N2O/c1-13(2,3)10-4-6-11(7-5-10)15-12-14-8-9-16-12/h10-11,15H,4-9H2,1-3H3
charge 0 multiplicity 1
40 atoms
O  3.218071 -1.084626 1.002643
N  1.416218 0.380708 0.716914
N  3.287452 0.422402 -0.804733
C  -2.209676 0.409257 -0.177309
C  -3.407395 -0.611847 -0.056114
C  -1.608368 0.832137 1.192898
C  -1.060352 -0.0624 -1.113337
C  0.63088 1.461192 0.078777
C  -0.498585 1.90278 1.03718
C  0.032912 1.016568 -1.281551
C  -4.013427 -0.875514 -1.463914
C  -2.964359 -1.96736 0.559045
C  -4.530566 -0.001814 0.831243
C  2.628043 -0.0295 0.235458
C  4.509958 -1.383388 0.310286
C  4.566481 -0.348399 -0.871845
H  -2.643511 1.329729 -0.635093
H  -1.206257 -0.063655 1.711387
H  -2.395592 1.2410 1.852219
H  -1.456674 -0.326838 -2.110845
H  -0.594492 -0.979875 -0.700516
H  1.324504 2.305384 -0.102378
H  -0.948728 2.825322 0.621412
H  -0.074032 2.168991 2.025329
H  0.851873 0.652263 -1.927732
H  -0.39749 1.912286 -1.774807
H  -4.290515 0.073774 -1.961926
H  -4.92787 -1.49247 -1.377734
H  -3.311235 -1.415242 -2.123356
H  -2.558024 -1.84124 1.579474
H  -2.194009 -2.464585 -0.057911
H  -3.829783 -2.65337 0.62881
H  -4.222487 0.093081 1.88806
H  -5.429599 -0.64619 0.807007
H  -4.823665 1.002354 0.468115
H  1.044246 -0.110448 1.528094
H  4.471072 -2.43273 -0.028111
H  5.319402 -1.254768 1.047873
H  5.426134 0.339978 -0.771091
H  4.651639 -0.853153 -1.851723
