program: Gaussian 09
title: 000297761
version: EM64L-G09RevD.01
frameworkgroup: C1[X(C10H12ClN3O4)]
method: RPBEPBE
basis: SDD
operation: Freq
keyword: #p
keyword: freq=noraman
keyword: PBEPBE/SDD
title: #p freq=noraman PBEPBE/SDD
converged: YES YES NO NO
title: Mulliken charges:
elementType: Cl O O O O N N N C C C C C C C C C C H H H H H H H H H H H H
charge: -0.083288 -0.306304 -0.292181 -0.220573 -0.204208 -0.487135 -0.404862 0.014609 0.359269 0.138908 -0.464281 0.430730 -0.277024 -0.416005 -0.326229 0.293759 -0.551416 -0.527139 0.360318 0.336152 0.250842 0.286211 0.246696 0.272757 0.301308 0.280897 0.270678 0.234296 0.234498 0.248721
chargesum: 0.00000
title: Mulliken charges with hydrogens summed into heavy atoms:
elementType: Cl O O O O N N N C C C C C C C C C C
charge: -0.083288 -0.306304 -0.292181 -0.220573 -0.204208 -0.150983 -0.103554 0.014609 0.359269 0.138908 -0.103964 0.430730 -0.026183 -0.129794 0.193223 0.293759 0.000158 0.190376
polarizability: 2.33484904e+02 1.58264816e+01 1.99688725e+02 1.09357082e+01 -1.19473551e+00 7.68249784e+01
1716.lowfreq: -0.5423 -0.0010 0.0012 0.0017 2.2761 6.1756 14.7979 36.4883 49.8878
frequency: 14.6693 36.4845 49.8860 64.1654 66.2098 80.8236 89.1970 114.4239 142.2391 164.8488 197.9980 208.7029 236.9128 255.6605 278.3014 301.2261 345.4961 353.0950 364.5571 426.0798 456.5316 485.8911 500.0360 554.1903 558.0771 581.7284 602.8091 616.7562 671.0666 698.0268 711.6243 712.8533 742.2517 748.2271 774.2587 814.1380 852.5262 923.1054 952.7371 960.7403 968.5895 987.8812 989.2709 1040.6229 1073.8894 1116.6949 1126.4098 1134.3913 1153.1761 1169.7568 1199.2706 1210.1768 1219.3282 1242.4076 1256.5451 1277.0291 1298.2726 1364.8614 1367.9249 1404.8636 1431.4692 1440.9463 1446.0045 1448.5799 1467.7567 1470.1245 1482.4959 1494.1908 1523.8218 1601.4828 1610.2936 1643.5367 2977.3907 2995.3408 3053.8101 3067.8221 3073.0232 3135.8756 3156.2065 3166.2061 3193.1173 3199.6064 3504.1891 3541.9979
redmass: 9.5227 7.4158 11.2426 7.5317 4.2835 4.2236 7.9629 3.7375 5.2067 4.3519 7.6377 1.5453 2.1904 3.6947 6.9112 4.6997 5.0207 6.3591 3.2640 1.7109 3.3269 5.9239 1.9653 5.0935 4.8182 5.3987 4.7212 7.0499 1.2147 5.4781 7.7521 4.6787 7.2984 4.4569 5.4743 1.5214 2.2052 4.6459 1.3432 1.3728 2.4439 5.2388 3.1934 1.9114 2.0342 1.2559 2.6602 1.7101 1.4610 1.3991 1.9877 3.5701 1.9532 1.6669 1.5300 2.7411 1.1850 11.5996 1.3173 3.4846 2.0085 1.1057 1.9389 1.1498 1.0509 1.2509 1.6478 2.0574 3.0317 6.4496 7.7491 4.6416 1.0320 1.0598 1.0958 1.0630 1.1050 1.1011 1.1121 1.0890 1.0955 1.0928 1.0761 1.0774
irintensity: 1.0153 2.0411 0.7515 6.3717 2.8690 1.1623 4.4234 1.7566 14.2447 3.9400 0.9907 0.0208 1.4419 5.0763 3.1710 2.8741 0.0717 3.3878 32.4380 8.2608 3.0895 8.0982 45.5628 3.4156 6.1526 38.7840 0.9211 21.4639 130.4217 21.6414 49.8825 18.6620 11.1063 0.6299 9.9169 39.7535 20.0262 11.5975 0.0187 41.0360 7.6194 42.4643 32.7566 14.1322 63.0906 0.1038 43.0882 23.8298 10.4502 11.9328 85.8732 427.9930 104.8486 212.4040 30.6047 170.6904 49.6738 93.5909 5.0357 81.9104 35.0003 8.3725 67.7415 50.2570 16.6811 95.4009 85.0733 283.1046 769.1200 42.1484 111.9796 125.2231 60.2262 52.5622 6.3126 20.7271 34.3103 15.2731 15.5388 7.8455 3.6260 25.4841 36.7989 44.9401
temp: 298.150 k
press: 1.00000 atm
elementType: 17 8 8 8 8 7 7 7 6 6 6 6 6 6 6 6 6 6 1 1 1 1 1 1 1 1 1 1 1 1
symmnumber: 1
zpe: 582791.9 jmol-1
zpe.correction: 0.221974 hartree
zpe.thermalcorrener: 0.239892 hartree
zpe.thermalcorrenthalpy: 0.240836 hartree
zpe.thermalcorrgfe: 0.172987 hartree
zpe.sumelectzpe: -1312.067601 hartree
zpe.sumelectthermal: -1312.049683 hartree
zpe.sumelectthermalent: -1312.048738 hartree
zpe.sumelectthermalfe: -1312.116587 hartree
dipole: 3.9239 7.9444 0.4771
dipole: 8.8734
quadrupole: -129.0446 -103.2981 -112.3065
quadrupole: -31.0393 1.8158 0.9050
quadrupole: -14.1616 11.5849 2.5766 -31.0393 1.8158 0.9050
hfenergy: -1312.2895749 hartree
pointgroup: C01 [X(C10H12Cl1N3O4)]
dipole: 1.5870231 -3.0982052 0.2646344 debye
polarizability: 233.9996996|-16.6621414|196.3608264|-7.9534878|-18.687247|79.6380812 unknown
InChI: InChI=1S/C10H12ClN3O4/c1-18-9-3-2-7(14(16)17)6-8(9)13-10(15)12-5-4-11/h2-3,6,12-13H,4-5H2,1H3
charge 0 multiplicity 1
30 atoms
Cl 6.174971 -0.214973 0.646196
O  -0.078672 -2.787379 0.305872
O  1.482082 1.805508 -0.597169
O  -4.671631 1.650583 0.135238
O  -2.818733 2.913467 -0.281415
N  1.045973 -0.481227 -0.197121
N  3.235465 0.259341 -0.553848
N  -3.394723 1.784596 -0.034644
C  -0.353684 -0.450899 -0.036172
C  -0.978295 -1.713638 0.241164
C  -1.157257 0.704449 -0.127042
C  -2.551881 0.572033 0.060618
C  -2.372078 -1.815208 0.423769
C  -3.175972 -0.661687 0.333723
C  4.264027 1.271544 -0.795059
C  1.889278 0.612898 -0.457783
C  5.236423 1.420041 0.374733
C  -0.611803 -4.125744 0.587454
H  -0.706231 1.675316 -0.337851
H  1.450815 -1.417668 -0.106112
H  -2.837548 -2.781458 0.635385
H  -4.258911 -0.701662 0.469187
H  4.824962 1.043276 -1.72103
H  3.7334 2.231614 -0.942408
H  3.55248 -0.696948 -0.382208
H  4.724913 1.619285 1.327072
H  6.017537 2.167683 0.172919
H  -1.321678 -4.43952 -0.200112
H  -1.105677 -4.151597 1.576454
H  0.263448 -4.790827 0.58899
