program: Gaussian 09
title: 000297745
version: EM64L-G09RevD.01
frameworkgroup: C1[X(C9H9Cl3N2O)]
method: RPBEPBE
basis: SDD
operation: Freq
keyword: #p
keyword: freq=noraman
keyword: PBEPBE/SDD
title: #p freq=noraman PBEPBE/SDD
converged: YES YES NO NO
title: Mulliken charges:
elementType: Cl Cl Cl O N N C C C C C C C C C H H H H H H H H H
charge: -0.079655 -0.050590 -0.055217 -0.294120 -0.497940 -0.407916 0.536824 -0.326399 0.304493 -0.463689 -0.303120 -0.552136 -0.056981 -0.022153 -0.279439 0.248539 0.272190 0.301907 0.300393 0.250998 0.337406 0.281122 0.271825 0.283656
chargesum: 0.00000
title: Mulliken charges with hydrogens summed into heavy atoms:
elementType: Cl Cl Cl O N N C C C C C C C C C
charge: -0.079655 -0.050590 -0.055217 -0.294120 -0.196033 -0.107523 0.536824 0.194331 0.304493 -0.212691 0.034286 0.000811 -0.056981 -0.022153 0.004218
polarizability: 2.13794505e+02 -2.96036325e-03 1.69557611e+02 -9.58255824e+00 -3.43874867e+00 6.60550428e+01
1716.lowfreq: 0.0026 0.0028 0.0030 3.0572 4.4173 6.8180 16.0064 38.1183 58.4245
frequency: 15.7791 37.9631 58.4184 62.3339 92.9365 110.8461 150.8011 165.8685 200.7939 203.0429 233.5363 255.4498 282.1562 355.6084 381.8637 409.8884 412.1368 430.3604 479.5232 515.5390 564.4224 587.6171 609.1454 624.6796 672.1295 705.6248 714.8815 760.2466 840.2226 850.5824 851.3281 896.1505 919.0316 972.2190 977.0698 990.0696 1044.3970 1093.6464 1106.2791 1129.3569 1169.1626 1211.7827 1235.9005 1254.1973 1269.9549 1298.1291 1363.9357 1373.5381 1407.7708 1440.2408 1449.2822 1452.9726 1488.3446 1508.6656 1577.8698 1609.2913 1646.7425 2997.5554 3055.9359 3068.2472 3150.6266 3156.2508 3193.6073 3201.0540 3528.6705 3540.7127
redmass: 10.0930 8.5498 6.3871 7.9179 8.2698 3.9530 6.9158 14.9279 9.8381 4.8549 3.3118 3.3317 10.6071 3.1850 7.4344 1.8942 4.2338 5.3011 2.4423 4.9218 3.1998 4.3974 1.4489 4.9520 2.3019 10.1383 4.7614 7.9454 1.4137 1.8745 1.7993 6.1000 1.3685 2.9301 4.0897 2.4986 2.0515 1.4795 1.7822 3.0233 1.4215 1.5074 1.3761 1.2539 2.5755 1.1809 2.3147 1.7931 4.0413 1.1043 1.1022 3.4605 1.8017 2.5523 5.1743 6.8610 4.4083 1.0600 1.0935 1.0651 1.0927 1.1121 1.0939 1.0935 1.0767 1.0769
irintensity: 0.8188 0.5257 1.6426 9.9116 8.1703 6.3941 0.8193 1.9680 1.3258 0.0298 1.1499 2.7764 2.1610 37.6277 0.1739 13.9475 7.9080 2.0007 8.3545 2.9973 23.6875 26.1577 167.6024 15.7796 30.3751 12.5801 32.0947 63.6759 23.1127 14.7509 40.3235 57.6809 32.3621 19.2525 6.9822 10.4718 17.0826 2.7881 24.0339 5.4033 28.5738 129.2831 262.6492 41.3006 0.5338 49.8959 83.0603 43.6906 37.5622 7.5790 36.2838 146.5380 206.7450 671.7112 245.8014 205.2443 163.4246 50.3612 6.0387 20.3486 3.9411 14.8578 3.3956 23.8415 4.9792 49.8394
temp: 298.150 k
press: 1.00000 atm
elementType: 17 17 17 8 7 7 6 6 6 6 6 6 6 6 6 1 1 1 1 1 1 1 1 1
symmnumber: 1
zpe: 445096.9 jmol-1
zpe.correction: 0.169528 hartree
zpe.thermalcorrener: 0.184793 hartree
zpe.thermalcorrenthalpy: 0.185738 hartree
zpe.thermalcorrgfe: 0.123608 hartree
zpe.sumelectzpe: -1912.186642 hartree
zpe.sumelectthermal: -1912.171377 hartree
zpe.sumelectthermalent: -1912.170433 hartree
zpe.sumelectthermalfe: -1912.232563 hartree
dipole: -3.6104 -1.8289 0.6184
dipole: 4.0942
quadrupole: -110.1035 -113.1373 -110.2239
quadrupole: -5.9433 -2.5039 -2.7436
quadrupole: 1.0514 -1.9824 0.9310 -5.9433 -2.5039 -2.7436
hfenergy: -1912.3561703 hartree
pointgroup: C01 [X(C9H9Cl3N2O1)]
dipole: -1.361429 -0.8445643 0.1667412 debye
dipolederiv: -0.3334001 -0.0864676 -0.0600202 -0.2115013 -0.4983128 -0.1049369 -0.0852926 -0.0332314 -0.230021 -0.2409358 -0.2178905 0.0114616 -0.2675822 -0.7319362 0.0085255 0.0125115 0.007517 -0.0681047 -0.4390944 0.3196216 0.045803 0.3724159 -0.5489256 -0.0500373 0.0517734 -0.0483585 -0.0755258 -0.8958739 -0.0511356 0.015968 0.0900895 -0.9151341 -0.0443132 0.0359644 -0.0120616 -0.3645996 -2.3101774 0.125403 0.1467204 0.5695802 -0.371225 -0.0554949 0.2127775 -0.0156085 -0.368631 -1.8204216 -0.1889436 0.0048524 -0.3374466 -0.3609142 0.0423243 0.0311322 0.0353119 -0.557926 1.7249534 0.0735187 -0.1423054 0.4140615 0.2522301 -0.0282529 -0.1658336 -0.0036235 0.1587053 0.6556199 -0.0871898 -0.0563491 -0.5716015 -0.0827827 -0.046491 -0.0903665 -0.0173801 0.2440283 2.9167418 0.1174786 -0.1606224 -0.4053107 1.2513234 0.0865284 -0.2389105 0.0112547 0.3192057 -0.6611914 0.0548503 0.0409051 0.3276042 -0.2178296 -0.0331684 0.0580875 -0.0058193 -0.2106184 -0.5760142 -0.1096463 0.0334124 -0.4301269 -0.3651355 0.0338007 0.0382394 0.005944 -0.1500191 0.2315732 0.1930345 0.0417503 0.3473032 0.683343 0.081757 0.090304 0.1082542 0.1610281 0.6434174 0.2245551 -0.0630233 0.4245109 1.1799411 -0.0084963 -0.0645315 0.0061579 -0.0302687 0.8445444 -0.3252698 -0.0984602 -0.5224057 0.92994 0.0781516 -0.1125716 0.0616427 -0.0091374 -0.4054042 0.0803126 0.0263594 0.0598794 -0.6508028 -0.0205107 0.0337089 -0.0230911 -0.1251521 -0.131707 0.0084835 0.0759252 0.0450333 0.113984 0.0823358 0.102234 0.0227469 -0.0748384 0.1832398 -0.0760449 -0.0339059 0.0871968 0.0359473 0.0075518 -0.0558549 -0.0270484 0.1071929 0.1297461 -0.0017438 0.0239986 -0.0017046 0.0855338 -0.004522 0.0223691 -0.0041444 0.3110913 0.2029297 0.0182068 0.0453405 0.1196426 0.1038301 -0.0216742 0.0805062 -0.0332778 0.3541314 0.0551632 -0.0749935 0.013231 -0.0735623 -0.0177985 0.0021326 0.0125568 0.0021962 0.1807308 0.2469956 0.0402625 -0.0002303 0.018137 0.1010413 -0.0027936 -0.0051203 -0.0061571 0.1891997 0.0782343 -0.0629185 0.0766879 -0.0743255 -0.0296567 0.0140726 0.0354505 0.0084603 -0.0455618 -0.1259036 0.0414169 -0.004902 0.0325033 -0.0528998 -0.0160057 -0.0164114 -0.0396469 0.1021162 0.0269648 -0.0149002 0.0174031 -0.0123903 0.1062395 -0.0004832 0.0172776 -0.0000372 0.1829744 unknown
polarizability: 213.5327011|4.200334|169.6982565|-8.9884386|5.4116288|66.1762016 unknown
InChI: InChI=1S/C9H9Cl3N2O/c10-1-2-13-9(15)14-8-4-6(11)3-7(12)5-8/h3-5,13-14H,1-2H2
charge 0 multiplicity 1
24 atoms
Cl -5.518524 -1.642867 -0.645718
Cl 3.346207 2.954937 -0.040644
Cl 4.29551 -2.511976 -0.287406
O  -1.478449 1.529314 0.451924
N  -0.50756 -0.623189 0.301356
N  -2.823899 -0.378713 0.538224
C  0.863603 -0.297973 0.15588
C  -4.066901 0.384676 0.662163
C  -1.592318 0.267059 0.430201
C  1.775072 -1.383715 0.025656
C  1.344438 1.040008 0.136179
C  -5.003532 0.186646 -0.529235
C  2.725858 1.24219 -0.014957
C  3.143205 -1.10971 -0.121029
C  3.663308 0.198312 -0.146825
H  -4.592084 0.120343 1.599323
H  -3.779148 1.451711 0.718742
H  -0.717112 -1.623402 0.319302
H  -2.912043 -1.393212 0.44931
H  1.422349 -2.420216 0.037114
H  0.645801 1.871048 0.237922
H  -4.51968 0.411236 -1.490359
H  -5.94543 0.742466 -0.412906
H  4.731227 0.392227 -0.262317
