program: Gaussian 09
title: 000297842
version: EM64L-G09RevD.01
frameworkgroup: C1[X(C26H26N2O5)]
method: RPBEPBE
basis: SDD
operation: Freq
keyword: #p
keyword: freq=noraman
keyword: PBEPBE/SDD
title: #p freq=noraman PBEPBE/SDD
converged: YES YES NO NO
title: Mulliken charges:
elementType: O O O O O N N C C C C C C C C C C C C C C C C C C C C C C C C C C H H H H H H H H H H H H H H H H H H H H H H H H H H
charge: -0.276354 -0.243953 -0.278479 -0.297582 -0.315088 -0.382191 -0.358879 -0.162901 -0.598790 0.488662 0.229885 -0.409631 -0.391963 0.231015 -0.529662 -0.462542 -0.232075 -0.209146 -0.247755 0.461587 -0.351562 -0.435993 0.335536 -0.450848 -0.232343 -0.221640 0.452694 -0.241105 -0.352486 -0.409821 -0.216697 -0.233643 -0.244742 0.291556 0.248995 0.254710 0.401017 0.234316 0.250863 0.254818 0.261981 0.261548 0.240559 0.221584 0.222299 0.224650 0.334546 0.289361 0.237627 0.240415 0.243136 0.228893 0.227578 0.228215 0.247917 0.238535 0.230212 0.239263 0.233899
chargesum: 0.00000
title: Mulliken charges with hydrogens summed into heavy atoms:
elementType: O O O O O N N C C C C C C C C C C C C C C C C C C C C C C C C C C
charge: -0.276354 -0.243953 -0.278479 -0.297582 -0.315088 0.018825 -0.024334 0.128655 -0.095086 0.488662 0.229885 -0.175315 -0.141099 0.231015 -0.012863 0.039565 -0.010491 0.013153 -0.023105 0.461587 -0.062201 -0.198366 0.335536 0.032703 -0.003450 0.005939 0.452694 -0.012890 -0.104569 -0.171286 0.013515 0.005620 -0.010843
polarizability: 2.45491419e+02 -1.02489007e+01 3.33498251e+02 2.83627492e+01 -3.84634504e+00 2.78308265e+02
1716.lowfreq: -8.2512 -3.1400 -0.0007 -0.0003 0.0004 4.2701 5.8314 12.6743 16.0228
frequency: 4.5673 12.2675 15.9649 20.9174 23.3995 26.7945 32.0485 33.8368 41.4329 48.5336 60.6149 71.1952 82.4378 86.7367 94.9142 130.1917 148.1000 163.5979 178.2676 183.8790 202.3716 219.1381 241.4919 252.5560 281.2077 299.1090 326.2806 334.2119 354.4478 369.3880 392.1299 400.2040 403.8241 404.8137 432.1033 459.2747 464.8871 483.9972 490.5701 520.0222 543.3295 551.9209 578.4053 592.9249 607.2538 615.2502 615.8335 617.5714 626.1425 637.2339 693.1872 701.6839 705.1895 705.9794 718.3690 726.9746 741.3354 746.3371 752.2747 757.4134 790.5702 805.3732 811.1132 826.2486 837.9532 855.8748 857.8965 863.5620 895.4463 914.7963 921.6092 925.0666 927.1321 935.2214 951.2388 979.1291 980.5251 981.5837 985.8905 989.1173 989.4296 990.1031 991.0405 995.0394 997.8668 999.4520 1007.9893 1010.2903 1026.3227 1027.3334 1028.3375 1082.2289 1087.1402 1091.6885 1101.8247 1124.6205 1154.6901 1171.4498 1172.7515 1173.4680 1187.8250 1188.1906 1191.4471 1193.7741 1207.0430 1213.5633 1214.7874 1221.4902 1233.1406 1241.0598 1247.6205 1254.7579 1276.9283 1305.9907 1317.3446 1326.9235 1332.4639 1339.1481 1341.7714 1350.2090 1352.7774 1382.7262 1386.2371 1386.8633 1438.1894 1439.4426 1440.2633 1440.7228 1453.1280 1463.2692 1470.5028 1484.1585 1484.8433 1486.3020 1486.9348 1510.9277 1591.8889 1594.1575 1594.4673 1613.5732 1614.6319 1615.0045 1615.6388 1638.3660 1646.7390 2988.5008 3015.8322 3017.5396 3022.4359 3031.5613 3079.5466 3089.2004 3102.3177 3110.3413 3114.1953 3120.0005 3122.9466 3123.1361 3125.7262 3129.5717 3133.9177 3135.3133 3140.7475 3144.7946 3146.7945 3151.4022 3161.0312 3162.0500 3166.2242 3425.3459 3577.1386
redmass: 4.7305 5.3830 5.4140 5.6798 5.0405 5.8016 4.7383 5.8316 5.7164 4.4690 4.8853 5.8482 7.2705 6.4283 7.5033 5.4437 5.0141 5.7701 6.1259 4.4279 4.9858 5.4168 6.6899 4.9405 6.6530 4.1535 2.4099 2.6948 4.0827 2.1684 3.9134 2.8153 2.8580 2.8437 4.5102 3.3502 3.8731 4.2489 4.6327 3.3919 3.8621 1.3555 4.3695 4.5729 4.8586 6.0690 6.3403 6.1126 5.3228 4.2240 3.7673 2.1447 2.4337 2.0765 2.0397 1.8205 1.8372 1.7031 3.1807 2.6288 3.3794 3.9279 3.7670 3.4572 3.5539 1.2549 1.2499 1.2549 6.0122 1.3948 2.4309 2.1164 1.4622 2.8395 4.5064 1.4170 1.5168 1.9102 1.4866 4.6328 3.9831 5.2268 2.4405 1.3241 1.7166 1.4918 1.9719 1.7870 2.1922 2.2242 2.1919 1.6589 1.5614 1.5676 4.9831 3.1405 2.6863 1.0577 1.0547 1.0558 1.1381 1.3827 1.2025 1.1799 1.8448 1.9703 2.3941 1.8352 1.3860 1.4191 1.2513 1.5606 1.4789 1.7862 1.3142 1.3223 1.2715 1.3065 1.3691 1.3528 1.3861 7.3974 6.5038 5.0484 1.8706 1.2012 2.0787 1.8813 1.2106 1.1511 1.1193 2.2445 2.2768 1.9253 2.1939 1.9448 5.9993 6.0351 6.0608 7.0643 6.1306 6.2973 6.1366 10.1160 7.2030 1.0809 1.0633 1.0609 1.0574 1.0572 1.1037 1.1071 1.1079 1.1006 1.0861 1.0850 1.0867 1.0861 1.0881 1.0873 1.0918 1.0927 1.0920 1.0962 1.0966 1.0964 1.1015 1.1016 1.1015 1.0811 1.0779
irintensity: 0.0557 0.1004 0.0700 0.0316 0.1035 0.4234 0.0480 0.6249 0.9808 0.3219 0.2934 7.3064 3.0229 1.2142 9.7846 2.6070 0.7406 1.7295 3.1389 7.5504 1.5597 2.9806 3.3921 7.0578 8.9180 2.3049 17.4418 14.8233 1.4104 6.7228 7.7585 0.8731 0.6094 0.0353 1.5698 18.1881 8.9146 20.5079 6.7218 21.8828 2.4229 113.9274 9.1918 13.7971 8.9747 4.3145 0.2357 0.2798 7.7616 0.5532 35.2925 72.6836 15.7448 48.1030 73.9822 97.6126 64.8699 30.2411 49.1860 11.4229 3.1618 3.0865 5.4392 4.2025 32.6556 2.4137 0.2103 0.4483 22.2286 9.1378 3.2113 4.9890 0.1871 79.0849 39.5117 0.4036 10.4605 22.4017 5.6987 1.1980 0.4569 0.4259 5.4532 1.4272 23.6895 1.3970 10.9871 8.6383 3.7962 1.6175 6.7621 34.8882 9.4676 4.5254 124.1512 14.2385 174.6074 0.9169 0.0275 0.2146 10.0546 8.6002 4.9828 4.0216 183.5550 9.7815 13.3786 56.7456 35.8400 16.8896 9.1984 57.0719 74.0488 0.5771 5.9920 10.5267 1.6174 7.8052 8.6611 12.2136 4.6060 0.1738 0.7120 1.8259 4.4344 21.0897 2.8077 14.6621 19.3752 17.5010 26.8251 58.8786 6.2180 210.4141 46.0385 296.2779 2.4577 1.7287 2.2484 93.0354 7.2642 24.9295 14.7509 134.1495 346.6743 10.5140 15.4543 17.7335 29.4975 13.3438 3.3754 4.8796 1.1291 7.4132 4.9337 1.2241 0.9109 3.1856 4.7115 0.4339 15.6001 13.0584 12.5234 34.2520 22.2914 29.2795 17.4621 28.9635 15.1039 150.9368 51.6534
temp: 298.150 k
press: 1.00000 atm
elementType: 8 8 8 8 8 7 7 6 6 6 6 6 6 6 6 6 6 6 6 6 6 6 6 6 6 6 6 6 6 6 6 6 6 1 1 1 1 1 1 1 1 1 1 1 1 1 1 1 1 1 1 1 1 1 1 1 1 1 1
symmnumber: 1
zpe: 1229997.9 jmol-1
zpe.correction: 0.468481 hartree
zpe.thermalcorrener: 0.499034 hartree
zpe.thermalcorrenthalpy: 0.499979 hartree
zpe.thermalcorrgfe: 0.398307 hartree
zpe.sumelectzpe: -1489.658051 hartree
zpe.sumelectthermal: -1489.627498 hartree
zpe.sumelectthermalent: -1489.626554 hartree
zpe.sumelectthermalfe: -1489.728225 hartree
dipole: 4.2939 1.4148 -2.8814
dipole: 5.3611
quadrupole: -190.0918 -181.1312 -187.5302
quadrupole: -9.8260 11.4451 7.4772
quadrupole: -3.8407 5.1198 -1.2791 -9.8260 11.4451 7.4772
hfenergy: -1490.1265321 hartree
pointgroup: C01 [X(C26H26N2O5)]
dipole: 1.8438582 -0.4716748 0.9091474 debye
polarizability: 238.8852989|3.1014701|335.3786487|-23.5252312|-2.4286969|283.0339877 unknown
InChI: InChI=1S/C26H26N2O5/c29-24(17-27-26(31)33-19-22-14-8-3-9-15-22)28-23(16-20-10-4-1-5-11-20)25(30)32-18-21-12-6-2-7-13-21/h1-15,23,27-28H,16-19H2
charge 0 multiplicity 1
59 atoms
O  -0.054839 -0.097439 -1.310867
O  -1.688976 -0.542394 -2.917822
O  -2.028127 4.161708 -0.61266
O  2.931134 2.569183 1.44676
O  0.962269 1.280568 1.691657
N  -1.21152 1.997098 -0.316479
N  0.905198 3.575095 1.223101
C  -1.892626 1.461232 -1.49954
C  -3.430747 1.232972 -1.272494
C  -3.74997 0.363802 -0.06687
C  -1.229484 0.173228 -1.999476
C  -4.059081 0.958954 1.18389
C  -3.723345 -1.053329 -0.155032
C  -1.328288 3.31834 0.034013
C  -0.556921 3.712204 1.316591
C  0.641301 -1.399185 -1.592411
C  -4.328258 0.162226 2.320055
C  -3.983961 -1.852395 0.980421
C  -4.287024 -1.247824 2.222477
C  0.256663 -2.4250 -0.546692
C  0.386531 -2.118008 0.833828
C  -0.223256 -3.698876 -0.935614
C  1.54003 2.382311 1.463725
C  3.758005 1.344027 1.649033
C  0.041295 -3.080634 1.806439
C  -0.55655 -4.666649 0.040695
C  4.10077 0.65364 0.342044
C  -0.42424 -4.358879 1.413914
C  4.52409 1.403796 -0.784588
C  4.055373 -0.759143 0.254559
C  4.898927 0.749564 -1.978295
C  4.444975 -1.416646 -0.935651
C  4.867287 -0.663628 -2.055356
H  -1.811977 2.211059 -2.313194
H  -3.824805 0.784644 -2.202268
H  -3.876578 2.23618 -1.156612
H  -0.622222 1.368253 0.246769
H  -4.100803 2.052948 1.25994
H  -3.498071 -1.530251 -1.116235
H  -0.801793 4.764491 1.52824
H  -0.91217 3.084404 2.154842
H  1.707002 -1.124188 -1.536966
H  0.378309 -1.72679 -2.612703
H  -4.572356 0.638977 3.276558
H  -3.948191 -2.944505 0.895424
H  -4.493183 -1.868089 3.102255
H  1.477788 4.38239 0.975687
H  0.726244 -1.120779 1.138919
H  -0.344405 -3.931295 -2.000591
H  4.659855 1.742555 2.144832
H  3.226494 0.661682 2.334453
H  0.128564 -2.832703 2.870252
H  -0.924773 -5.651178 -0.269339
H  -0.687605 -5.105282 2.172093
H  4.547098 2.497663 -0.724118
H  3.712441 -1.348618 1.113565
H  5.219431 1.337828 -2.845386
H  4.410408 -2.510521 -0.988497
H  5.166263 -1.171096 -2.979271
