program: Gaussian 09
title: 000297774
version: EM64L-G09RevD.01
frameworkgroup: C1[X(C17H13F7N2O)]
method: RPBEPBE
basis: SDD
operation: Freq
keyword: #p
keyword: freq=noraman
keyword: PBEPBE/SDD
title: #p freq=noraman PBEPBE/SDD
converged: YES YES NO NO
title: Mulliken charges:
elementType: F F F F F F F O N N C C C C C C C C C C C C C C C C C H H H H H H H H H H H H H
charge: -0.156515 -0.126791 -0.159640 -0.150497 -0.157152 -0.121582 -0.193514 -0.412281 -0.123098 -0.458103 0.021148 -0.604885 0.386827 0.360708 0.131342 0.307644 -0.363631 -0.328397 -0.375883 -0.371455 0.330893 0.485162 -0.422883 -0.346455 -0.189979 -0.200289 -0.259303 0.273414 0.279369 0.387207 0.288551 0.250082 0.321815 0.267105 0.265447 0.221347 0.250475 0.228340 0.232022 0.233433
chargesum: 0.00000
title: Mulliken charges with hydrogens summed into heavy atoms:
elementType: F F F F F F F O N N C C C C C C C C C C C C C C C C C
charge: -0.156515 -0.126791 -0.159640 -0.150497 -0.157152 -0.121582 -0.193514 -0.025074 -0.123098 -0.136288 0.021148 -0.052102 0.386827 0.360708 0.131342 0.307644 -0.075080 -0.078314 -0.108778 -0.106008 0.330893 0.485162 -0.201536 -0.095979 0.038361 0.031733 -0.025871
polarizability: 2.53386023e+02 -4.57795190e+01 2.89474426e+02 2.86104352e+01 -1.34968835e+00 1.34645327e+02
1716.lowfreq: -8.1756 -6.8396 -3.4064 0.0007 0.0012 0.0013 9.9249 17.1100 28.4796
frequency: 9.3145 17.0716 28.4571 32.3393 33.2566 43.9400 51.1725 68.2536 82.3279 129.2121 140.2417 155.4253 173.5542 196.3177 202.5840 230.2251 239.8966 257.4611 280.5326 289.3696 299.4603 311.1163 318.8024 349.7205 380.2417 404.1061 405.2085 409.0756 429.9120 456.3795 460.5788 467.3057 487.6653 504.0804 513.7382 539.2372 551.3058 568.6748 590.9845 612.9994 614.1550 622.9122 637.4869 659.5774 685.3534 692.5126 719.8860 739.6269 760.3795 805.8879 820.8387 825.5731 829.4223 841.8388 850.2588 858.2111 897.0006 926.2394 953.4992 965.9073 968.9111 981.2347 985.0759 988.5852 995.7416 1003.5163 1023.6395 1032.2735 1045.0412 1059.3757 1084.1496 1092.3458 1100.7486 1110.9156 1150.6442 1160.2972 1168.8047 1174.2030 1177.2086 1187.6458 1208.6330 1246.0091 1281.0737 1297.1588 1308.9848 1322.5811 1337.2808 1359.8309 1384.8842 1407.8097 1435.4971 1457.7976 1482.9325 1490.9757 1495.7094 1528.3706 1570.2122 1587.5956 1602.0181 1607.6299 1615.2736 2797.0557 3018.1329 3099.2342 3115.5393 3137.6176 3139.5471 3144.8500 3148.3408 3167.6676 3176.9066 3180.3095 3180.7984 3440.3048
redmass: 12.0632 10.9538 4.6200 6.8496 6.3426 10.3624 4.7724 12.3248 7.2668 7.6348 11.3267 7.2965 7.2823 8.9956 8.8287 5.8412 6.1962 9.6848 8.9873 5.6537 10.6373 7.3433 9.9342 3.5603 5.8836 8.7743 3.0606 2.9568 5.6264 9.6875 8.9715 8.8513 14.7195 2.8535 3.9766 2.1929 8.1993 4.0306 3.2179 6.3483 5.2199 7.8453 6.6818 5.7953 7.7257 1.9048 4.6289 5.0022 1.7263 6.4164 1.1690 1.2565 1.2493 1.5825 4.8312 4.5619 1.4527 3.5333 1.3913 1.3680 1.3355 6.0678 7.3278 1.3404 3.5289 3.1146 2.2043 5.9340 7.4438 7.5532 4.5006 1.9244 3.4968 1.6083 4.6068 1.5250 3.3661 1.1944 3.9351 1.1429 2.1261 1.9946 2.2343 1.3035 1.7404 1.4041 1.9199 5.2945 6.3107 3.6879 2.2170 1.1127 1.8695 2.5525 2.0236 1.4218 4.9094 7.5703 5.2683 6.1974 6.1886 1.0705 1.0638 1.0981 1.0885 1.0867 1.0904 1.0902 1.0929 1.0970 1.0956 1.0964 1.0976 1.0756
irintensity: 0.2007 0.4481 0.0714 0.0575 0.3502 0.2915 0.0589 0.3414 0.1030 3.8896 1.3116 2.4150 2.0263 1.7609 1.9647 1.1639 0.4066 0.4855 3.1822 0.7151 2.2555 1.5957 1.8651 18.7581 1.0122 3.3616 0.1323 0.8457 3.7957 3.8451 2.7392 6.3482 1.6318 19.2348 10.0293 34.3852 4.7705 52.9362 2.3516 1.3566 35.9834 17.4109 10.9071 16.2948 8.9180 42.2855 7.0978 7.6425 74.2727 21.7632 40.6926 11.3474 5.6715 51.5033 7.5778 55.0223 10.4901 113.1594 6.9559 0.4408 1.5690 18.3735 38.1773 6.2386 65.2615 18.0079 2.0334 13.2325 88.2190 277.1630 158.2770 12.0345 10.1454 19.7414 220.6981 88.1280 49.8656 40.7872 212.9541 12.9616 50.1378 34.9077 139.1159 2.0657 40.0474 7.3755 35.7103 10.0564 3.6905 5.4779 2.5238 5.6443 45.9770 204.7887 49.8228 50.3908 240.7267 3.6064 3.7488 43.2859 138.7408 956.3483 2.6316 1.7734 13.6145 0.3601 2.5030 6.1110 22.5778 31.2232 0.8415 2.3272 4.3789 4.8227
temp: 298.150 k
press: 1.00000 atm
elementType: 9 9 9 9 9 9 9 8 7 7 6 6 6 6 6 6 6 6 6 6 6 6 6 6 6 6 6 1 1 1 1 1 1 1 1 1 1 1 1 1
symmnumber: 1
zpe: 715923.3 jmol-1
zpe.correction: 0.272681 hartree
zpe.thermalcorrener: 0.297208 hartree
zpe.thermalcorrenthalpy: 0.298152 hartree
zpe.thermalcorrgfe: 0.214067 hartree
zpe.sumelectzpe: -1537.244188 hartree
zpe.sumelectthermal: -1537.219661 hartree
zpe.sumelectthermalent: -1537.218717 hartree
zpe.sumelectthermalfe: -1537.302801 hartree
dipole: 5.2836 3.3351 -1.9178
dipole: 6.5358
quadrupole: -153.2196 -161.7765 -154.3758
quadrupole: -10.2415 8.2234 -1.6936
quadrupole: 3.2377 -5.3192 2.0815 -10.2415 8.2234 -1.6936
hfenergy: -1537.5168689 hartree
pointgroup: C01 [X(C17H13F7N2O1)]
dipole: -2.3475631 -0.8632969 -0.5964284 debye
polarizability: 232.9145856|-35.4150704|308.046293|-28.3198964|-5.6058289|136.544897 unknown
InChI: InChI=1S/C17H13F7N2O/c18-12-8-6-11(7-9-12)14(26-25-13-4-2-1-3-5-13)10-15(27,16(19,20)21)17(22,23)24/h1-9,25,27H,10H2
charge 0 multiplicity 1
40 atoms
F  3.110225 -1.226157 1.333371
F  3.419733 0.92086 1.985899
F  1.342504 0.031126 1.983428
F  3.409492 1.14497 -2.301317
F  4.462156 -0.357827 -0.971739
F  4.414733 1.837741 -0.40418
F  -2.140862 -5.782582 0.639675
O  1.625779 1.821712 -0.166696
N  -0.604803 0.513463 -0.479424
N  -1.924762 0.606491 -0.152356
C  2.30114 0.557758 -0.206958
C  1.497426 -0.541997 -0.987736
C  2.563545 0.080755 1.267591
C  3.651202 0.80697 -0.951441
C  0.039262 -0.648161 -0.54415
C  -0.547509 -1.981095 -0.234668
C  -1.274872 -2.203093 0.970917
C  -0.352702 -3.072298 -1.127037
C  -1.808462 -3.473305 1.271687
C  -0.884817 -4.346694 -0.844709
C  -1.606839 -4.515729 0.350023
C  -2.613346 1.843877 -0.181176
C  -3.982023 1.846912 0.199098
C  -1.983348 3.055285 -0.567339
C  -4.710758 3.053413 0.19631
C  -2.725614 4.254477 -0.559493
C  -4.088182 4.266597 -0.17981
H  2.001206 -1.514991 -0.875631
H  1.541884 -0.255787 -2.054752
H  0.622116 1.608048 -0.289388
H  -1.368042 -1.397328 1.707608
H  0.208222 -2.922309 -2.055929
H  -2.462803 -0.248988 0.031828
H  -2.349757 -3.662084 2.2030
H  -0.746942 -5.191037 -1.525716
H  -4.471664 0.910993 0.497684
H  -0.936118 3.062393 -0.879645
H  -5.765664 3.044549 0.491483
H  -2.232437 5.186421 -0.856644
H  -4.654599 5.203253 -0.178567
