program: Gaussian 09
title: 000297746
version: EM64L-G09RevD.01
frameworkgroup: C1[X(C16H22N2)]
method: RPBEPBE
basis: SDD
operation: Freq
keyword: #pfreq=noraman
keyword: PBEPBE/SDD
title: #p freq=noraman PBEPBE/SDD
converged: YES YES NO NO
title: Mulliken charges:
elementType: N N C C C C C C C C C C C C C C C C H H H H H H H H H H H H H H H H H H H H H H
charge: -0.006207 -0.006089 0.038330 0.026507 -0.523003 -0.453558 -0.460067 -0.473976 -0.468129 -0.406027 -0.406633 -0.384288 -0.589592 -0.586184 0.427484 0.114323 -0.246678 -0.247223 0.204416 0.213974 0.203512 0.202408 0.190538 0.199303 0.197763 0.194156 0.230957 0.224053 0.223054 0.224230 0.199537 0.193131 0.190512 0.199056 0.201781 0.189032 0.226696 0.257493 0.256577 0.228830
chargesum: 0.00000
title: Mulliken charges with hydrogens summed into heavy atoms:
elementType: N N C C C C C C C C C C C C C C C C
charge: -0.006207 -0.006089 0.242746 0.240481 -0.117082 -0.063718 -0.068148 -0.018966 -0.020845 -0.013358 -0.017066 0.006525 -0.105403 -0.100776 0.427484 0.114323 -0.246678 -0.247223
polarizability: 2.41425433e+02 -1.77634316e-01 1.70546818e+02 -1.17920742e+01 -3.71680693e+00 1.34006056e+02
1716.lowfreq: -21.2574 -12.7509 -0.0004 0.0002 0.0008 6.2760 21.4615 30.7648 49.5738
frequency: 18.5302 30.5260 49.1189 62.1147 86.1582 109.2172 128.9281 143.3922 175.0382 197.3545 213.0534 222.7610 241.1665 268.1901 309.8587 358.2682 368.4788 402.3344 415.3679 428.3337 431.9427 454.4341 468.8144 495.4960 515.9604 547.0411 574.7728 591.3182 638.4413 725.1463 759.5594 780.4371 782.3382 796.1540 838.6656 845.7277 893.4954 896.7727 909.5724 918.2497 925.9430 943.1596 960.2582 969.4582 1023.8485 1038.4444 1051.5319 1056.8757 1075.1988 1083.1232 1091.3824 1106.5451 1111.2690 1117.0500 1134.7509 1155.2812 1167.6832 1187.6996 1210.9269 1229.8213 1245.7590 1253.3469 1258.3835 1264.8289 1273.0572 1283.5462 1298.6778 1301.6148 1310.8978 1312.2547 1326.9558 1334.5498 1336.5743 1340.4171 1342.1488 1348.3712 1355.8062 1358.9058 1361.6731 1451.9667 1454.8182 1457.8546 1461.6000 1462.6534 1464.3015 1467.2847 1468.1389 1473.9775 1476.6253 1590.2402 2172.2801 2178.9681 2937.6608 2940.7663 2948.3926 2951.1016 2956.6880 2962.0197 2963.3249 2964.4001 2965.8642 2967.6110 2977.6994 2981.9956 2999.6829 3013.3500 3020.1363 3026.7023 3027.6120 3039.9156 3042.7635 3049.8999 3061.9582 3063.6824
redmass: 4.4018 4.4879 3.6773 5.0398 4.2115 3.6028 7.9168 3.2815 3.4309 2.6978 2.3310 3.1387 3.8163 2.3910 1.7349 4.0673 2.8478 2.2036 1.9621 3.4523 2.8347 2.4164 4.5002 3.1261 6.8596 2.0531 3.3413 10.3956 5.3093 3.5064 2.5462 1.5510 1.4885 1.9707 1.7888 2.3032 1.5589 2.1075 1.9989 1.6786 1.8760 2.2639 2.2065 2.3421 3.0489 1.9120 1.7604 1.1134 1.9382 1.7861 1.2106 2.1361 2.0420 2.4485 2.0486 2.9756 1.7361 1.6770 1.5991 1.3837 1.3094 1.2149 1.2715 1.2876 1.2595 1.2743 1.4020 1.5482 1.2993 1.3079 1.4057 1.3644 1.5939 1.5540 1.4902 1.5997 1.4796 1.5216 1.4838 1.0886 1.1005 1.0896 1.0904 1.0893 1.0865 1.1005 1.0823 1.0934 1.0905 7.4522 12.6317 12.6437 1.0787 1.0606 1.0676 1.0747 1.0639 1.0662 1.0631 1.0638 1.0635 1.0663 1.0608 1.0631 1.0991 1.0965 1.0994 1.0967 1.0992 1.1036 1.1007 1.0999 1.0950 1.0963
irintensity: 1.1119 2.2679 0.3638 0.2196 0.3977 0.8490 5.2142 0.3698 0.6227 0.0483 0.9215 3.3086 1.0778 0.2338 0.0633 0.1965 0.8236 0.8941 0.3147 0.2100 0.0337 0.4592 0.2668 0.9111 0.4646 0.3639 0.4698 0.0457 0.3884 3.4693 0.3547 0.4347 0.5008 0.7191 2.1630 8.8295 10.9676 3.0670 1.0136 5.1898 5.0170 5.9707 1.1201 30.1240 18.1006 0.0611 0.7378 0.1163 2.6832 0.1139 0.6518 0.2691 2.1451 0.4673 6.4878 5.1170 1.4802 0.7216 1.7582 0.7092 1.6542 1.7689 1.8623 1.1052 3.3541 0.4863 0.8902 2.1167 11.9595 4.5476 0.4678 0.0840 0.2229 1.7585 0.5632 2.1519 1.8490 2.1142 1.7609 1.0294 11.6356 4.5179 5.3442 7.2743 11.1596 24.2345 18.9206 4.7847 5.7257 85.7076 12.4254 30.7076 6.0397 14.8977 8.9418 26.1500 69.3882 2.4987 21.1789 29.5058 34.0192 13.7926 23.8605 40.4495 20.8964 99.5385 59.6699 56.0361 37.6250 105.0891 64.1861 45.9008 15.3747 16.2368
temp: 298.150 k
press: 1.00000 atm
elementType: 7 7 6 6 6 6 6 6 6 6 6 6 6 6 6 6 6 6 1 1 1 1 1 1 1 1 1 1 1 1 1 1 1 1 1 1 1 1 1 1
symmnumber: 1
zpe: 903685.9 jmol-1
zpe.correction: 0.344196 hartree
zpe.thermalcorrener: 0.361965 hartree
zpe.thermalcorrenthalpy: 0.362909 hartree
zpe.thermalcorrgfe: 0.296967 hartree
zpe.sumelectzpe: -731.011040 hartree
zpe.sumelectthermal: -730.993271 hartree
zpe.sumelectthermalent: -730.992327 hartree
zpe.sumelectthermalfe: -731.058269 hartree
dipole: -6.8328 -1.2214 1.8317
dipole: 7.1788
quadrupole: -152.7150 -120.0563 -108.0989
quadrupole: -3.0122 7.0121 1.2571
quadrupole: -25.7583 6.9005 18.8578 -3.0122 7.0121 1.2571
hfenergy: -731.3552361 hartree
pointgroup: C01 [X(C16H22N2)]
dipole: 2.6852919 -0.4854636 -0.7283336 debye
polarizability: 241.1397761|0.3889056|170.8139976|-13.0426404|1.8662865|134.0245341 unknown
InChI: InChI=1S/C16H22N2/c17-11-16(12-18)15-8-6-14(7-9-15)10-13-4-2-1-3-5-13/h13-14H,1-10H2
charge 0 multiplicity 1
40 atoms
N  -5.492565 -1.70166 0.436786
N  -4.539902 2.666567 0.62574
C  2.945561 -0.076506 0.364631
C  0.443944 -0.67064 -0.23219
C  1.729864 -1.019564 0.561491
C  4.123157 -0.532679 1.26756
C  3.410256 0.003661 -1.113123
C  -0.105854 0.734166 0.119893
C  -0.647888 -1.740292 0.02126
C  5.370689 0.367336 1.107406
C  4.659735 0.902175 -1.281546
C  5.821069 0.438576 -0.370682
C  -1.430696 1.056958 -0.634787
C  -1.972431 -1.433066 -0.738961
C  -2.453262 -0.035251 -0.426501
C  -3.727456 0.222077 0.052284
C  -4.691958 -0.829894 0.263211
C  -4.17138 1.558548 0.3658
H  2.660893 0.949152 0.688092
H  0.680824 -0.683239 -1.318387
H  1.476924 -1.050611 1.643252
H  2.042235 -2.050013 0.286588
H  4.392129 -1.577674 1.001993
H  3.79676 -0.548273 2.326955
H  2.592893 0.383801 -1.757402
H  3.645334 -1.02288 -1.468035
H  0.633075 1.517639 -0.12959
H  -0.283173 0.793936 1.212991
H  -0.858789 -1.799801 1.108163
H  -0.283817 -2.737915 -0.290223
H  6.195362 -0.009861 1.742897
H  5.132662 1.390596 1.465643
H  4.39283 1.94831 -1.023119
H  4.981785 0.908154 -2.341185
H  6.686545 1.121051 -0.476873
H  6.16226 -0.56607 -0.696812
H  -1.202695 1.114576 -1.720293
H  -1.820116 2.043334 -0.329142
H  -2.740003 -2.190766 -0.505054
H  -1.768701 -1.495058 -1.828933
