program: Gaussian 09
title: 000297756
version: EM64L-G09RevD.01
frameworkgroup: C1[X(C16H30N2)]
method: RPBEPBE
basis: SDD
operation: Freq
keyword: #pfreq=noraman
keyword: PBEPBE/SDD
title: #p freq=noraman PBEPBE/SDD
converged: NO YES NO NO
title: Mulliken charges:
elementType: N N C C C C C C C C C C C C C C C C H H H H H H H H H H H H H H H H H H H H H H H H H H H H H H
charge: -0.108531 -0.106428 0.047036 0.046822 -0.529813 -0.462839 -0.473019 -0.462751 -0.455470 -0.431132 -0.457942 -0.154957 -0.405446 -0.405092 -0.383319 -0.114562 -0.599337 -0.636215 0.201101 0.202172 0.194169 0.195235 0.190320 0.212796 0.209427 0.200154 0.190747 0.204737 0.195898 0.189452 0.208982 0.181589 0.199797 0.186450 0.212022 0.194750 0.187945 0.189837 0.194293 0.196456 0.187473 0.189552 0.223419 0.221525 0.218021 0.213892 0.214367 0.286415
chargesum: 0.00000
title: Mulliken charges with hydrogens summed into heavy atoms:
elementType: N N C C C C C C C C C C C C C C C C
charge: -0.108531 -0.106428 0.248137 0.248994 -0.140409 -0.059723 -0.063438 -0.067267 -0.070120 -0.040560 -0.071696 0.057065 -0.022751 -0.020963 0.000611 0.074990 0.063628 0.078460
polarizability: 2.11725436e+02 1.27128159e+01 1.85498029e+02 6.41485681e+00 8.14898288e-01 1.57770900e+02
1716.lowfreq: -19.2041 -7.0679 -0.0008 -0.0005 -0.0003 11.8720 19.1990 22.9851 30.6358
frequency: 14.2907 22.1074 29.9284 55.6057 70.5853 77.3960 114.5078 129.6806 142.1481 151.5559 193.7511 199.1529 210.9088 221.0029 256.0809 270.3865 301.0510 310.3603 331.6363 346.9660 390.4607 404.0249 411.1484 421.8444 429.0360 450.9573 498.4978 522.7263 544.8989 554.3745 700.4395 756.6393 768.7149 775.5929 788.8497 814.9978 836.9950 843.5210 870.4827 885.5158 890.1292 907.3027 921.0562 925.3060 942.4666 949.2916 956.4863 973.5250 1034.2170 1046.6158 1048.7169 1051.7306 1060.2235 1062.8999 1081.1833 1087.3743 1090.4436 1096.2211 1097.8581 1106.9408 1114.7111 1135.4408 1142.1292 1152.9813 1162.8987 1177.4501 1206.0111 1232.6363 1246.9529 1249.8914 1253.1562 1257.5641 1263.7241 1274.6434 1293.8328 1295.8093 1303.0755 1306.6227 1316.7639 1327.5996 1331.6882 1336.6316 1337.7188 1338.1724 1341.3007 1349.3219 1352.7517 1357.0046 1362.7142 1373.4869 1393.1248 1411.2831 1441.1641 1448.0028 1450.7735 1453.8795 1457.2144 1457.3251 1458.9093 1460.7962 1465.6458 1467.7861 1472.0093 1474.7572 1475.6561 1486.0518 1508.6588 1652.2218 2930.7661 2932.7889 2935.4532 2937.2397 2937.5105 2947.7685 2948.1471 2955.3015 2959.1526 2960.0094 2961.1541 2962.2215 2964.2078 2967.2265 2970.7014 2978.7865 2991.0962 3001.6266 3010.7111 3012.0756 3017.6621 3019.5826 3021.6939 3022.1108 3023.5094 3029.7613 3036.1608 3048.4752 3076.4198 3099.3194
redmass: 3.5047 3.1658 2.6261 3.3185 1.5803 2.9163 2.8225 2.7844 1.2565 2.3436 2.2148 2.4037 1.8313 2.4653 3.3173 2.5461 2.3903 1.7648 2.6884 2.3327 2.1388 1.9582 2.0346 2.8722 2.7256 2.1493 3.2615 3.0227 2.3464 2.2705 2.8982 2.5602 1.5453 1.4847 2.1646 3.0830 1.7392 2.4469 3.3993 1.7906 1.6135 2.0104 1.8410 1.5006 2.2920 1.5620 2.5684 2.3765 1.8597 1.5281 1.7949 1.3069 1.3616 1.5854 2.0714 1.5210 1.5591 1.3697 1.2352 2.4013 2.4088 1.8480 1.3621 1.9138 1.3388 1.6989 1.4908 1.3539 1.3565 3.0929 1.2613 1.2838 1.2803 1.2257 1.4093 1.2719 1.3668 1.4317 1.3263 1.3994 1.3784 1.4191 1.4948 1.5440 1.4959 1.4991 1.4814 1.5223 1.5091 1.3304 3.2402 1.1522 1.1711 1.0869 1.0906 1.0898 1.0472 1.0875 1.0911 1.0871 1.0830 1.0851 1.0930 1.0948 1.0790 1.0473 1.1598 5.7974 1.0766 1.0646 1.0779 1.0396 1.0775 1.0610 1.0395 1.0646 1.0622 1.0621 1.0636 1.0651 1.0655 1.0648 1.0721 1.0693 1.0994 1.0999 1.0986 1.0966 1.1007 1.0995 1.0968 1.0999 1.1001 1.1002 1.1036 1.0995 1.0963 1.0969
irintensity: 0.0894 0.3611 1.5852 0.3671 0.0188 0.1728 0.7894 4.3426 0.1027 1.2414 2.3368 3.2500 0.0082 0.9881 3.5103 4.2576 2.5549 0.1745 20.0880 0.5946 2.4826 0.5204 1.5971 3.2527 0.0381 0.2288 3.9493 2.1916 0.7831 2.7203 0.5175 0.5485 0.4761 0.0360 0.1986 0.9448 3.5195 5.7861 5.5904 8.8576 6.5528 1.4995 5.1140 14.7584 1.8017 12.8479 6.7191 36.4202 9.8073 6.6665 3.7749 0.9400 5.1330 1.6178 27.2051 2.0848 78.5796 36.9451 1.5466 0.5702 2.0554 4.1345 1.0521 3.0732 0.6000 0.3633 1.3067 2.1792 1.4532 24.2916 1.4025 8.3735 2.0624 3.7505 2.7644 2.7361 8.2521 34.0454 2.4170 5.2658 0.5943 0.9372 0.5131 3.0382 3.9511 14.6701 21.3925 2.4696 4.9822 40.5554 12.7881 30.9606 11.4279 1.2585 11.1554 6.0829 12.7179 2.5547 8.3164 8.7281 10.0120 21.9515 2.9593 5.0914 16.6238 20.3134 5.2927 498.5520 7.9028 20.8237 52.3437 74.7877 5.1398 13.6525 164.5532 50.3593 26.8336 31.3052 38.6680 32.4419 29.6489 49.4134 91.8424 51.3133 19.9829 64.2728 53.4663 91.5045 47.0770 79.2300 52.0563 22.4358 16.2961 122.6108 153.9272 60.3302 30.1293 1.6486
temp: 298.150 k
press: 1.00000 atm
elementType: 7 7 6 6 6 6 6 6 6 6 6 6 6 6 6 6 6 6 1 1 1 1 1 1 1 1 1 1 1 1 1 1 1 1 1 1 1 1 1 1 1 1 1 1 1 1 1 1
symmnumber: 1
zpe: 1140863.0 jmol-1
zpe.correction: 0.434532 hartree
zpe.thermalcorrener: 0.454411 hartree
zpe.thermalcorrenthalpy: 0.455355 hartree
zpe.thermalcorrgfe: 0.383980 hartree
zpe.sumelectzpe: -735.733044 hartree
zpe.sumelectthermal: -735.713164 hartree
zpe.sumelectthermalent: -735.712220 hartree
zpe.sumelectthermalfe: -735.783596 hartree
dipole: 0.5430 2.0018 -1.1116
dipole: 2.3533
quadrupole: -110.4030 -109.3506 -112.5570
quadrupole: 10.8537 -2.5764 -0.3328
quadrupole: 0.3672 1.4196 -1.7868 10.8537 -2.5764 -0.3328
hfenergy: -736.1675756 hartree
pointgroup: C01 [X(C16H30N2)]
dipole: -0.2673352 -0.7654172 -0.4470493 debye
polarizability: 212.1568587|11.6856404|184.4472263|-8.4733033|-0.3172292|158.3902804 unknown
InChI: InChI=1S/C16H30N2/c1-18(2)13-17-16-10-8-15(9-11-16)12-14-6-4-3-5-7-14/h13-16H,3-12H2,1-2H3
charge 0 multiplicity 1
48 atoms
N  -3.24389 0.857019 0.164807
N  -4.464336 -1.170087 0.033216
C  0.519855 1.087875 0.325603
C  2.645045 -0.469134 0.094561
C  1.536833 0.129831 0.998439
C  -0.509398 1.599166 1.368939
C  -0.223884 0.423968 -0.862658
C  3.544738 0.613022 -0.557818
C  3.516699 -1.463616 0.905968
C  -1.558365 2.546944 0.747976
C  -1.2969 1.358828 -1.472837
C  -2.322262 1.866392 -0.418939
C  4.671577 -0.010639 -1.417665
C  4.639857 -2.095706 0.050759
C  5.526475 -1.006918 -0.599084
C  -3.548761 -0.244744 -0.463776
C  -4.722218 -2.432277 -0.65887
C  -5.137221 -0.943349 1.315728
H  1.068024 1.972894 -0.067698
H  2.162468 -1.046494 -0.724946
H  0.968779 -0.708479 1.457773
H  2.025176 0.669159 1.839464
H  0.021319 2.110451 2.197216
H  -1.03848 0.730537 1.811878
H  -0.696335 -0.51252 -0.50113
H  0.496002 0.133302 -1.652434
H  3.997151 1.231993 0.246855
H  2.933605 1.296841 -1.178756
H  2.872985 -2.256722 1.337353
H  3.971792 -0.922587 1.763525
H  -2.293722 2.857718 1.512764
H  -1.060802 3.461955 0.365204
H  -0.796977 2.249366 -1.905974
H  -1.810395 0.856991 -2.318211
H  -2.959058 2.641241 -0.899327
H  5.313025 0.78732 -1.840923
H  4.217326 -0.545689 -2.278123
H  4.184128 -2.717301 -0.748422
H  5.257684 -2.774658 0.670911
H  6.296594 -1.472307 -1.245168
H  6.067152 -0.454554 0.197938
H  -3.130009 -0.560446 -1.440427
H  -5.80347 -2.558007 -0.870879
H  -4.390294 -3.305356 -0.058427
H  -4.179899 -2.451734 -1.620308
H  -4.850008 -1.712915 2.061309
H  -6.238488 -0.970348 1.194062
H  -4.828815 0.048373 1.682955
