program: Gaussian 09
title: 000297729
version: EM64L-G09RevD.01
frameworkgroup: C1[X(C12H16O)]
method: RPBEPBE
basis: SDD
operation: Freq
keyword: #pfreq=noraman
keyword: PBEPBE/SDD
title: #p freq=noraman PBEPBE/SDD
converged: YES YES NO NO
title: Mulliken charges:
elementType: O C C C C C C C C C C C C H H H H H H H H H H H H H H H H
charge: -0.221571 -0.164415 -0.376941 -0.364358 0.111356 -0.725227 0.298426 -0.696719 -0.355571 -0.355887 -0.250020 -0.227484 -0.226268 0.204043 0.184839 0.220814 0.183753 0.226467 0.222530 0.230382 0.234663 0.204066 0.216992 0.215194 0.235522 0.278974 0.229998 0.233123 0.233315
chargesum: 0.00000
title: Mulliken charges with hydrogens summed into heavy atoms:
elementType: O C C C C C C C C C C C C
charge: -0.221571 0.039629 0.028712 0.045862 0.111356 -0.037652 0.298426 -0.060467 -0.120048 -0.076912 -0.020021 0.005639 0.007047
polarizability: 1.73802978e+02 5.43891705e+00 1.15141811e+02 1.34499050e+01 -1.70806958e+01 1.00708837e+02
1716.lowfreq: -6.3582 -0.0003 0.0005 0.0006 8.9267 10.6246 29.3844 43.7569 76.5040
frequency: 29.3249 43.7311 76.4691 93.8069 139.2375 146.4780 175.2196 210.6346 231.7864 238.9504 276.9342 318.3686 388.4843 400.0845 418.7021 450.3332 492.2718 613.8228 628.5071 687.8630 701.0009 711.0028 754.0853 795.9063 857.8997 863.4766 876.5764 917.9569 944.7399 967.2347 988.9021 991.2545 1004.5074 1011.6201 1025.7287 1028.8385 1059.8776 1079.7828 1098.1867 1118.7399 1153.2775 1172.9551 1190.2170 1215.3061 1243.9597 1255.0033 1293.7632 1302.5699 1310.9531 1350.0733 1356.2008 1385.1977 1386.6463 1389.6202 1435.2824 1453.3523 1472.7601 1472.8275 1476.6915 1477.8407 1482.4104 1485.9540 1563.9974 1595.4589 1610.7519 2966.2814 2972.5816 2976.8594 2981.4083 2991.4909 3020.6620 3047.6008 3070.0757 3073.3468 3080.6658 3083.6612 3127.9559 3137.6098 3149.4100 3158.4176 3168.9543
redmass: 4.8444 3.5042 2.2247 2.1833 3.8823 4.2380 2.4807 1.2156 1.1647 2.2635 3.0780 4.3349 3.3735 2.8027 4.5692 3.4143 3.8274 6.3092 3.4978 4.1649 1.6714 2.1896 1.3245 2.2309 1.3105 1.4752 1.4527 2.5097 1.4298 2.4356 4.8211 1.4340 1.5126 1.3633 2.1629 2.1313 2.9165 1.5203 1.6381 1.9833 2.2897 1.0665 1.1747 2.0541 1.6721 1.2829 1.1669 1.3240 1.3622 1.4577 1.5560 1.4622 4.0455 1.2167 2.2578 1.0833 1.0717 1.0529 2.0838 1.0451 1.0713 1.0755 7.2877 6.6058 6.4487 1.0606 1.0377 1.0600 1.0367 1.0824 1.0944 1.1016 1.1001 1.1002 1.1000 1.1004 1.0849 1.0879 1.0923 1.0958 1.1012
irintensity: 1.4353 0.0391 0.5153 1.3562 0.6662 0.4757 0.4175 0.3830 0.1188 0.8527 0.3644 8.6154 0.0233 0.0030 0.1719 2.8742 8.4025 0.1402 4.2102 0.5190 67.9384 25.7416 5.6619 27.6916 0.4236 1.6894 2.0490 5.4735 5.1790 81.1324 1.8762 0.5331 1.4339 0.8661 4.5516 4.4306 2.1278 1.8058 17.8218 6.4597 24.5042 1.6421 8.6496 88.4574 59.1968 3.8169 9.7602 3.5620 0.2645 5.8868 14.6124 14.4464 8.9358 8.2522 20.2722 10.9254 2.0301 15.2498 0.2987 13.2377 10.1073 15.3616 94.4702 27.6605 8.1717 24.2018 32.6153 43.9239 45.5354 19.2973 7.8238 9.5397 63.3767 54.6003 45.9474 31.4366 0.2663 6.2513 19.3823 21.5658 21.9546
temp: 298.150 k
press: 1.00000 atm
elementType: 8 6 6 6 6 6 6 6 6 6 6 6 6 1 1 1 1 1 1 1 1 1 1 1 1 1 1 1 1
symmnumber: 1
zpe: 648366.3 jmol-1
zpe.correction: 0.246950 hartree
zpe.thermalcorrener: 0.260448 hartree
zpe.thermalcorrenthalpy: 0.261392 hartree
zpe.thermalcorrgfe: 0.205888 hartree
zpe.sumelectzpe: -541.121961 hartree
zpe.sumelectthermal: -541.108463 hartree
zpe.sumelectthermalent: -541.107519 hartree
zpe.sumelectthermalfe: -541.163023 hartree
dipole: -1.6728 1.9904 -1.8331
dipole: 3.1812
quadrupole: -70.3287 -77.5447 -81.4338
quadrupole: 3.6597 0.4241 -1.1477
quadrupole: 6.1070 -1.1090 -4.9980 3.6597 0.4241 -1.1477
hfenergy: -541.3689112 hartree
pointgroup: C01 [X(C12H16O1)]
dipole: 0.6394506 0.3996638 0.9989231 debye
polarizability: 175.8634623|0.9347791|94.6903037|4.6066919|15.6311715|119.0998601 unknown
InChI: InChI=1S/C12H16O/c1-3-7-10(2)12(13)11-8-5-4-6-9-11/h4-6,8-10H,3,7H2,1-2H3
charge 0 multiplicity 1
29 atoms
O  -0.764429 -0.354235 -1.703052
C  -1.424185 0.594007 0.446046
C  -2.824388 -0.025171 0.221984
C  -2.907326 -1.524614 0.588058
C  -0.392642 0.049976 -0.560291
C  -1.464285 2.146085 0.299937
C  1.073785 0.054474 -0.207105
C  -4.325762 -2.101259 0.3899
C  1.568401 0.475259 1.057759
C  1.999147 -0.38431 -1.194492
C  2.954139 0.455857 1.326657
C  3.381197 -0.40535 -0.925981
C  3.863758 0.015273 0.337528
H  -1.09303 0.351623 1.475179
H  -3.560222 0.541737 0.828451
H  -3.103416 0.10596 -0.841024
H  -2.593666 -1.66511 1.643514
H  -2.19116 -2.092144 -0.036832
H  -2.161591 2.575703 1.041767
H  -0.471543 2.606769 0.451015
H  -1.820938 2.423241 -0.70853
H  -5.065309 -1.566137 1.015789
H  -4.644773 -2.004047 -0.664632
H  -4.367892 -3.173004 0.657889
H  0.880332 0.816322 1.83805
H  1.600425 -0.7038 -2.163162
H  3.324884 0.781527 2.30477
H  4.083582 -0.747156 -1.694107
H  4.938907 -0.000873 0.548914
