program: Gaussian 09
title: 000297711
version: EM64L-G09RevD.01
frameworkgroup: C1[X(C10H12N2)]
method: RPBEPBE
basis: SDD
operation: Freq
keyword: #pfreq=noraman
keyword: PBEPBE/SDD
title: #p freq=noraman PBEPBE/SDD
converged: YES YES NO NO
title: Mulliken charges:
elementType: N N C C C C C C C C C C H H H H H H H H H H H H
charge: -0.239675 -0.017871 -0.153951 0.286932 -0.504006 -0.488597 -0.061190 -0.486249 -0.527411 -0.188004 -0.200955 -0.220908 0.247052 0.238403 0.230920 0.240117 0.245162 0.241700 0.214311 0.233336 0.260117 0.210620 0.211613 0.228533
chargesum: 0.00000
title: Mulliken charges with hydrogens summed into heavy atoms:
elementType: N N C C C C C C C C C C
charge: -0.011142 -0.017871 0.093101 0.286932 -0.034683 -0.003318 -0.061190 -0.030238 -0.033958 0.022616 0.010658 -0.220908
polarizability: 1.18227424e+02 -3.21737674e+00 1.09835872e+02 -7.26041005e+00 2.20429297e+00 9.55367007e+01
1716.lowfreq: -18.1172 -0.0007 -0.0007 0.0002 7.9024 9.4032 69.7065 85.1798 119.8844
frequency: 69.6279 85.1703 119.8747 160.6785 179.2355 221.7098 277.2424 364.7890 378.9163 407.3445 475.0364 505.0145 523.6606 548.8710 571.5068 619.9323 639.5272 657.9829 792.4054 828.4063 852.0404 877.5789 891.8371 908.9867 930.3941 956.4590 975.6882 1000.0185 1007.2488 1028.5084 1051.9441 1076.3010 1090.4214 1110.4522 1148.5285 1180.0531 1201.2210 1229.3173 1234.9820 1261.7957 1284.8439 1290.0190 1307.6404 1324.8684 1334.2647 1352.8381 1384.0250 1442.0150 1455.1362 1457.6871 1484.4192 1651.1085 1685.1404 2194.0257 2961.4432 2964.1121 2989.1681 2990.2628 3004.6172 3010.9760 3040.6349 3053.6515 3077.2470 3103.1837 3133.7770 3304.5966
redmass: 3.7879 3.2925 5.6844 4.0086 2.1727 3.3115 2.7998 2.7340 2.8146 6.0930 5.1920 3.2308 3.9223 3.7341 4.1881 4.3364 3.7423 1.2536 1.6698 3.3839 1.8590 1.8013 1.9565 2.1662 2.4918 2.4362 1.2381 2.3823 2.1045 2.7736 2.1049 2.0912 1.8092 1.6471 1.3745 1.2905 1.3097 1.2529 1.4061 1.5243 1.3931 1.5145 1.6008 1.7658 1.6097 1.4134 1.5984 1.0809 1.0847 1.0821 1.0850 8.3992 6.5311 12.6482 1.0625 1.0675 1.0647 1.0808 1.0946 1.0669 1.0924 1.0984 1.1041 1.0841 1.0994 1.0763
irintensity: 1.2098 1.8081 1.5685 1.0440 0.8598 0.3251 4.6650 0.9327 1.9655 2.7363 0.9134 3.2095 0.8827 10.3175 2.9713 4.2562 2.0365 50.7382 3.9806 6.0053 22.8447 14.9672 19.6159 2.4734 11.9288 37.8679 0.0656 2.7183 17.1471 24.4877 4.8783 10.6509 13.0467 3.7943 4.8808 14.7672 4.3059 0.3510 28.6208 8.0255 0.3683 15.1334 3.1137 9.2162 2.0166 0.7701 0.4072 12.6792 14.0380 11.3439 12.0294 74.4742 3.7683 14.5821 17.6735 31.6450 13.3283 28.1084 8.1102 38.3868 9.3716 12.3722 32.8656 5.8478 48.4164 10.5338
temp: 298.150 k
press: 1.00000 atm
elementType: 7 7 6 6 6 6 6 6 6 6 6 6 1 1 1 1 1 1 1 1 1 1 1 1
symmnumber: 1
zpe: 518715.2 jmol-1
zpe.correction: 0.197568 hartree
zpe.thermalcorrener: 0.208212 hartree
zpe.thermalcorrenthalpy: 0.209156 hartree
zpe.thermalcorrgfe: 0.161455 hartree
zpe.sumelectzpe: -496.833979 hartree
zpe.sumelectthermal: -496.823335 hartree
zpe.sumelectthermalent: -496.822391 hartree
zpe.sumelectthermalfe: -496.870092 hartree
dipole: 0.4428 -6.2231 1.0353
dipole: 6.3242
quadrupole: -65.8958 -84.2659 -69.0656
quadrupole: 6.4602 -0.1591 6.0629
quadrupole: 7.1799 -11.1901 4.0101 6.4602 -0.1591 6.0629
hfenergy: -497.0315474 hartree
pointgroup: C01 [X(C10H12N2)]
dipole: -0.4557968 2.4356106 0.2254429 debye
dipolederiv: -0.6728782 0.1865426 -0.0989255 0.4067422 -0.3039935 0.1068303 -0.173215 0.0501321 -0.4505674 -0.2057491 -0.0038845 0.0055875 0.0053307 -0.3244306 -0.0281621 0.0043418 -0.0617253 -0.2348727 0.1159887 -0.048637 -0.0589862 -0.0569387 0.0867244 -0.0189985 0.0318037 -0.0908635 0.1003651 -0.1546921 -0.0695415 -0.0513158 -0.0485902 -0.0536699 0.0043519 0.0408615 -0.0035476 0.1017001 0.0324163 -0.0090521 -0.0107363 -0.0087943 -0.0007666 -0.0668513 -0.0564968 0.0209672 0.1220508 -0.0137851 -0.0612626 -0.0489492 0.0465312 -0.2459381 0.1352849 -0.1274562 0.0945149 0.1326558 0.8078887 0.1320347 0.1959625 0.005009 0.4750061 -0.1620139 0.2227533 -0.1322154 0.0622469 0.0092021 -0.0282397 0.0170718 -0.0245017 0.1498857 -0.0063472 0.0258751 0.0470292 -0.0357364 0.0054419 -0.0149093 -0.019365 -0.0559526 0.1077765 -0.0029634 -0.1456628 0.0436391 0.062263 0.0616284 0.0224584 -0.0887341 0.0334102 -0.2033932 -0.0720635 -0.0548963 -0.1148997 0.1465732 0.1811556 0.0011817 -0.0067376 0.0065195 -0.2131084 -0.0526692 0.0430902 -0.0658913 -0.0394716 -0.0799365 -0.0067192 0.0036547 -0.0394829 0.2320022 0.1153894 -0.0131628 0.1626595 -0.0434743 0.0007325 0.0012658 0.0982944 0.0044482 0.0324333 -0.015976 0.0879083 -0.0189511 -0.1068089 -0.0254979 0.0394981 0.0650385 0.0189788 0.076399 -0.0252197 0.082125 -0.0739121 -0.0635826 0.0415738 0.0302187 -0.0382168 0.0362175 -0.0715962 0.0924139 -0.0405034 0.1325943 -0.0255669 0.0062722 -0.0307722 -0.0645474 -0.0320011 -0.0012754 -0.0513778 -0.0874952 -0.1096662 -0.0087434 -0.010546 0.0002697 0.0625456 0.0312636 0.0602058 0.0055772 0.1023943 0.0523978 -0.0236658 0.0525555 -0.0529635 0.0379679 -0.0744547 -0.0160363 -0.1120933 -0.0311078 -0.0719534 -0.0536275 0.0051045 0.0696985 -0.0130831 0.1058756 -0.0695691 0.1338441 -0.0299398 0.077128 0.0253967 -0.0244693 -0.0197611 -0.0528913 -0.0747829 -0.0490368 -0.1241699 -0.0275964 -0.1018434 0.0364347 0.008282 0.0369994 -0.0337255 0.0468107 -0.0085427 0.0993276 0.0115789 0.0748783 0.0456282 -0.1736726 -0.0138718 0.0242271 -0.0107101 0.1411848 0.0289578 0.0178696 0.0321846 0.0632327 -0.0520592 -0.0171705 0.0941838 -0.0228351 0.137341 0.071433 0.1007628 0.0612023 -0.0583844 0.0850438 -0.1433824 -0.01832 -0.2980927 0.0623981 -0.0545044 0.0161679 -0.0038586 0.2459546 unknown
polarizability: 117.9806014|-1.6061712|108.9927542|8.7446463|-2.3562566|96.6266407 unknown
InChI: InChI=1S/C10H12N2/c11-7-10-6-2-1-3-8(10)4-5-9(10)12/h1-2,8,12H,3-6H2
charge 0 multiplicity 1
24 atoms
N  2.704226 -0.225695 0.736093
N  0.495158 -2.770168 -0.906763
C  -0.411143 0.649103 -0.976876
C  0.31018 -0.293756 0.055632
C  0.01304 2.061347 -0.487882
C  1.513261 1.889562 -0.129475
C  1.672638 0.410443 0.269696
C  -1.926924 0.397141 -1.112112
C  -0.432134 -0.297063 1.44498
C  -2.609252 0.033346 0.191264
C  -1.94116 -0.295179 1.325845
C  0.431993 -1.665352 -0.461423
H  0.062085 0.480211 -1.965349
H  -0.577649 2.354368 0.399461
H  -0.151529 2.827033 -1.265546
H  1.862669 2.56534 0.671955
H  2.148968 2.080611 -1.016925
H  -2.104809 -0.419121 -1.842768
H  -2.406877 1.296395 -1.549508
H  -0.106798 0.590982 2.026452
H  -0.078516 -1.170394 2.022662
H  -3.707216 0.010366 0.184784
H  -2.502237 -0.564641 2.230628
H  3.539426 0.386017 0.860275
