program: Gaussian 09
title: 000297724
version: EM64L-G09RevD.01
frameworkgroup: C1[X(C15H15NO)]
method: RPBEPBE
basis: SDD
operation: Freq
keyword: #p
keyword: freq=noraman
keyword: PBEPBE/SDD
title: #p freq=noraman PBEPBE/SDD
converged: YES YES NO NO
title: Mulliken charges:
elementType: O N C C C C C C C C C C C C C C C H H H H H H H H H H H H H H H
charge: -0.259921 -0.447520 -0.709919 0.553818 0.496760 -0.591388 0.493975 -0.405750 -0.481239 -0.373966 -0.451686 -0.197609 -0.225750 -0.221713 -0.249217 0.211316 -0.799769 0.225026 0.235661 0.311983 0.247137 0.218969 0.241156 0.231570 0.223949 0.308481 0.223780 0.223886 0.226698 0.236246 0.268927 0.236109
chargesum: 0.00000
title: Mulliken charges with hydrogens summed into heavy atoms:
elementType: O N C C C C C C C C C C C C C C C
charge: -0.259921 -0.139039 -0.249232 0.553818 0.496760 -0.279406 0.493975 -0.158613 -0.262269 -0.132809 -0.220116 0.026341 -0.001970 0.002173 -0.022519 0.211316 -0.058487
polarizability: 2.49045179e+02 1.28672520e+01 1.41901922e+02 -9.91714432e+00 5.58062905e+00 1.25210480e+02
1716.lowfreq: -68.5074 -6.5868 -4.4240 -0.0005 -0.0003 0.0002 5.4633 16.6030 22.5869
frequency: -68.4587 16.4073 22.3754 51.6744 71.1529 91.5787 117.2797 196.8050 219.7495 245.7997 255.1661 319.7952 332.9234 377.7737 404.1910 439.2525 461.7764 521.1331 539.6989 556.2924 584.8394 618.2086 635.8001 648.4436 654.8283 701.4789 704.5017 736.6959 772.6434 792.7151 816.4034 853.4231 885.2389 907.2755 922.2589 933.9646 937.2455 964.3546 973.9386 976.2187 985.1213 990.6346 993.8003 1003.2771 1026.8662 1030.4221 1081.1642 1099.5564 1163.3443 1170.6940 1181.8113 1185.0566 1187.6567 1209.9923 1231.4899 1272.9088 1287.8322 1316.9036 1334.5035 1376.1229 1381.2994 1387.2534 1428.8680 1439.5119 1451.6441 1461.0220 1469.4582 1474.9787 1484.2496 1520.9292 1592.3363 1602.0676 1612.7340 1617.9478 1632.6290 2975.6742 2986.9488 3023.3436 3071.8732 3109.3625 3113.7001 3118.9437 3132.0277 3132.8047 3136.0192 3142.9057 3155.6331 3160.9091 3176.5926 3520.4273
redmass: 1.0637 4.4502 3.9079 5.4626 4.7537 3.4279 5.0773 3.8980 4.4456 4.6585 3.8476 2.6815 3.9898 3.7254 2.8044 3.1288 3.2222 4.2431 3.4190 5.1322 3.2334 6.3110 2.2150 1.6288 5.4897 2.0397 1.8630 2.2012 2.5148 2.2717 2.5470 1.2487 1.4186 1.6234 3.0866 2.4319 1.7325 1.7280 1.3773 1.3953 5.4524 6.1741 1.3237 1.8711 2.1844 1.6575 1.5848 1.6684 1.7851 1.0608 1.1060 1.1052 1.1174 2.5979 2.7494 1.9330 1.8374 1.3541 1.3407 1.2436 7.1129 6.8726 2.5688 2.1176 1.2627 1.2084 1.0472 1.9586 2.1839 2.0619 6.0563 5.9933 6.0836 6.0728 5.0335 1.0601 1.0384 1.1000 1.0984 1.0884 1.0867 1.0864 1.0913 1.0897 1.0978 1.0961 1.0987 1.1015 1.0929 1.0764
irintensity: 0.0256 0.2045 0.1306 8.8094 2.6150 1.0763 3.4346 2.3436 1.9995 2.7372 1.3666 0.9239 1.7139 0.7691 0.1905 5.6533 8.2643 17.0222 6.2428 3.7006 1.5378 0.6557 19.2315 35.8149 3.0615 38.4924 41.2435 41.3020 31.1841 41.7642 11.0193 0.0509 1.3700 2.9164 5.4671 7.6743 11.5092 7.0952 0.9333 0.1120 0.3002 0.5046 0.7085 35.1522 12.2037 7.7623 16.1813 10.3833 1.6880 0.2743 2.0181 2.6111 2.3306 1.5068 86.6825 10.4780 13.6641 18.7762 3.7843 40.6807 2.5956 56.8314 240.8098 5.6606 9.5102 13.2338 20.0421 20.8684 15.0259 279.6408 8.9451 81.8360 42.4923 29.5797 123.1546 22.7334 10.0788 10.3513 15.8606 15.2812 8.6193 2.2004 14.7723 14.6605 7.1936 45.4488 19.4543 26.7257 7.5290 11.2529
temp: 298.150 k
press: 1.00000 atm
elementType: 8 7 6 6 6 6 6 6 6 6 6 6 6 6 6 6 6 1 1 1 1 1 1 1 1 1 1 1 1 1 1 1
symmnumber: 1
zpe: 681300.5 jmol-1
zpe.correction: 0.259494 hartree
zpe.thermalcorrener: 0.274055 hartree
zpe.thermalcorrenthalpy: 0.274999 hartree
zpe.thermalcorrgfe: 0.215142 hartree
zpe.sumelectzpe: -709.390228 hartree
zpe.sumelectthermal: -709.375666 hartree
zpe.sumelectthermalent: -709.374722 hartree
zpe.sumelectthermalfe: -709.434579 hartree
dipole: -1.8885 3.0078 1.1020
dipole: 3.7186
quadrupole: -75.1168 -104.2668 -96.9185
quadrupole: -8.7037 -7.1643 -0.3216
quadrupole: 16.9839 -12.1661 -4.8178 -8.7037 -7.1643 -0.3216
hfenergy: -709.6497214 hartree
pointgroup: C01 [X(C15H15N1O1)]
dipole: 0.8443072 0.7734219 -0.910688 debye
polarizability: 245.8640205|-24.5807138|136.7388004|1.1073036|-10.79524|133.5547601 unknown
InChI: InChI=1S/C15H15NO/c1-12(17)16-15-9-5-8-14(11-15)10-13-6-3-2-4-7-13/h2-9,11,16H,10H2,1H3
charge 0 multiplicity 1
32 atoms
O  3.378718 -1.889158 1.34598
N  3.667623 -0.179669 -0.240916
C  -1.149245 0.091849 1.238302
C  0.007828 0.567421 0.357875
C  -2.481896 -0.088104 0.514258
C  1.273083 -0.055808 0.470335
C  2.368064 0.404374 -0.307866
C  -0.163961 1.651187 -0.540826
C  2.189376 1.493649 -1.201319
C  -2.574901 -0.915093 -0.636103
C  -3.658592 0.541891 0.990401
C  0.925862 2.10795 -1.3127
C  -3.811563 -1.109844 -1.288221
C  -4.900156 0.35082 0.339608
C  -4.981118 -0.477482 -0.802256
C  4.1152 -1.249204 0.539576
C  5.59418 -1.583013 0.330582
H  -1.290975 0.81551 2.065907
H  -0.856365 -0.863852 1.715394
H  1.427023 -0.895335 1.152135
H  -1.147144 2.124498 -0.639501
H  3.031629 1.853889 -1.806818
H  -1.670571 -1.402101 -1.020738
H  -3.60342 1.185291 1.877755
H  0.793307 2.946037 -2.005917
H  4.365616 0.249619 -0.853547
H  -3.865619 -1.754048 -2.173472
H  -5.799425 0.846396 0.723179
H  -5.941421 -0.62866 -1.308176
H  5.798587 -1.868357 -0.718239
H  5.856646 -2.427757 0.983176
H  6.241428 -0.723195 0.585554
