program: Gaussian 09
title: 000297705
version: EM64L-G09RevD.01
frameworkgroup: C1[X(C9H10ClF3S)]
method: RPBEPBE
basis: SDD
operation: Freq
keyword: #p
keyword: freq=noraman
keyword: PBEPBE/SDD
title: #p freq=noraman PBEPBE/SDD
converged: NO YES NO NO
title: Mulliken charges:
elementType: Cl S F F F C C C C C C C C C H H H H H H H H H H
charge: 0.040140 0.314185 -0.131133 -0.126469 -0.148030 -0.175492 -0.042675 -0.102700 -0.607345 -0.492384 -0.487632 -0.463656 -0.155626 0.010189 0.279785 0.294072 0.261175 0.313056 0.232474 0.274328 0.242465 0.216089 0.213890 0.241293
chargesum: 0.00000
title: Mulliken charges with hydrogens summed into heavy atoms:
elementType: Cl S F F F C C C C C C C C C
charge: 0.040140 0.314185 -0.131133 -0.126469 -0.148030 0.104293 0.251397 0.158475 -0.294289 0.014419 -0.029078 -0.008473 -0.155626 0.010189
polarizability: 1.33955354e+02 -5.58676454e+00 1.17725691e+02 -4.55620398e-01 -6.60745701e+00 9.19193664e+01
1716.lowfreq: -19.5706 -9.3258 -0.0019 0.0018 0.0022 6.3343 60.7986 87.8655 138.9909
frequency: 60.7426 87.7421 138.9905 176.4353 201.2091 217.5786 252.7733 268.9473 284.6883 316.2250 318.9953 353.5801 379.4542 432.6976 458.6934 489.7875 539.1564 595.8126 653.7459 719.9795 755.0591 764.0590 798.8385 822.9854 847.1106 872.4221 888.8376 914.4736 925.2939 940.2540 955.1584 960.5255 963.9072 1000.8435 1028.2598 1043.7615 1053.0244 1104.0381 1116.7561 1133.3530 1145.9747 1170.0791 1186.6318 1194.4266 1212.9391 1229.9507 1263.0325 1270.0636 1280.1536 1298.5103 1300.1974 1307.3978 1324.2284 1467.8343 1475.5597 1492.6228 3003.0938 3016.5261 3035.4944 3054.8729 3058.7954 3072.7847 3080.3460 3083.4300 3094.3163 3114.1869
redmass: 9.1555 3.8101 9.9308 7.4898 8.6523 8.3902 2.5303 8.3448 6.6376 8.1168 5.1725 11.2247 13.9261 8.1142 2.2732 6.7186 9.6219 5.4185 4.8652 8.7822 3.9976 4.4342 1.7366 3.6879 3.2962 2.7634 2.9800 4.0703 2.9974 4.1271 2.2998 3.2443 1.7622 3.2429 1.9419 1.5008 1.9265 2.0916 1.3009 2.0616 1.5793 3.5863 1.5960 1.6084 1.3434 1.2381 1.4122 1.3418 1.5427 1.4126 1.5342 1.5850 1.4167 1.0791 1.0882 1.0972 1.0590 1.0624 1.0628 1.0932 1.0967 1.0909 1.0923 1.0982 1.0924 1.1035
irintensity: 0.2982 0.1572 0.3660 0.7551 0.5004 4.1850 0.3609 0.1092 2.0710 1.3940 3.0532 0.3136 1.4036 1.4025 1.5796 1.3815 4.7354 1.5963 30.7769 71.0982 2.5231 36.2449 10.6862 48.6628 6.9403 0.7286 2.1024 13.8231 2.1012 116.6870 17.5056 97.0415 5.6969 23.8535 18.1858 14.3063 20.1406 19.3322 21.8310 55.5582 10.4393 8.2459 4.7031 6.9644 0.1457 4.9256 2.5488 0.9893 0.5433 5.9611 14.4490 8.6410 10.4351 4.3109 21.3687 9.6932 28.8224 52.7305 24.3429 0.9325 1.8049 5.7891 39.6613 47.6476 10.2372 14.9112
temp: 298.150 k
press: 1.00000 atm
elementType: 17 16 9 9 9 6 6 6 6 6 6 6 6 6 1 1 1 1 1 1 1 1 1 1
symmnumber: 1
zpe: 460978.8 jmol-1
zpe.correction: 0.175578 hartree
zpe.thermalcorrener: 0.187759 hartree
zpe.thermalcorrenthalpy: 0.188703 hartree
zpe.thermalcorrgfe: 0.137181 hartree
zpe.sumelectzpe: -1505.528681 hartree
zpe.sumelectthermal: -1505.516499 hartree
zpe.sumelectthermalent: -1505.515555 hartree
zpe.sumelectthermalfe: -1505.567077 hartree
dipole: 5.3097 0.4314 -1.0309
dipole: 5.4261
quadrupole: -95.5436 -96.4141 -96.9990
quadrupole: -0.7963 -0.3803 -0.9740
quadrupole: 0.7753 -0.0952 -0.6801 -0.7963 -0.3803 -0.9740
hfenergy: -1505.7042581 hartree
pointgroup: C01 [X(C9H10Cl1F3S1)]
dipole: 2.0997222 0.1129487 0.3683759 debye
dipolederiv: -0.2890396 -0.1894725 0.1079885 -0.2813275 -0.5100427 0.2041902 0.1293462 0.1840995 -0.2317591 -0.4798194 -0.0549897 0.0099236 -0.192133 -0.2657743 0.0621466 0.0220654 -0.032589 -0.087895 -0.3268181 -0.0464834 0.0172867 -0.0490551 -0.3348651 -0.1114897 0.0679511 -0.0364756 -0.6697531 -0.8360942 -0.0225345 -0.2506994 -0.0569571 -0.232735 -0.0159398 -0.2539481 -0.0284834 -0.3770889 -0.4662927 0.0002656 0.2022008 -0.0183499 -0.2977103 -0.0504614 0.3257697 0.0161001 -0.7256779 0.1803178 -0.0405357 0.0042831 -0.0579246 0.0808551 0.0212192 -0.0776628 0.0316503 0.0529383 -0.2226285 0.0467771 -0.0781416 -0.065351 -0.0875425 0.0131934 -0.0201386 0.0395043 -0.0562493 0.0401585 0.0281617 -0.0140827 0.0510132 0.0598094 -0.0291489 -0.1537127 -0.0003105 0.0237426 0.4612623 -0.1663638 0.1215769 -0.104194 0.0589819 0.008735 0.1938375 -0.0122292 0.1454399 0.0147384 -0.005529 -0.0391361 -0.0070418 -0.0260371 0.0061256 -0.0310283 0.0065317 -0.0426893 0.030379 -0.0591957 -0.0439783 -0.0271495 0.0462566 -0.0045913 -0.021621 -0.0108478 0.0970097 -0.003907 0.0519036 -0.0599204 -0.012463 0.0247033 0.0217796 0.0441599 0.025875 0.1025994 0.5829247 0.2747682 -0.1414441 0.4380434 0.8640611 -0.1372227 -0.1575903 -0.1994836 0.8554357 1.3993307 0.1457917 0.0248999 0.2890671 0.6343883 0.0015193 -0.2018093 0.0567522 1.0410599 0.0386593 -0.0403017 -0.0156024 -0.0250368 -0.0989499 -0.0373884 0.0008436 -0.0443783 0.0637101 0.0583374 -0.0085304 0.0044032 0.0151197 0.0241373 0.03031 0.0362744 0.0387189 -0.0469154 0.0503381 -0.0168243 0.0030257 -0.036134 -0.1117749 0.0674942 0.0267111 0.0672584 0.0517246 -0.0391652 0.0181467 -0.0341243 0.0359227 0.0016739 -0.0041528 -0.0450816 -0.0505755 -0.0816768 -0.1104696 0.0382367 0.1453937 0.0405964 0.0627624 -0.0320549 0.0985684 -0.0221176 0.0298207 0.0194026 0.0132883 -0.1264142 0.0135227 0.0667228 0.0258666 -0.1026539 0.0115346 0.0123822 -0.0996339 0.1060026 0.0388096 0.0860397 -0.01825 -0.0208447 0.0734814 -0.0612662 0.0530056 0.0732232 -0.0336691 0.0525969 -0.0098042 0.0232211 0.0551311 -0.0039647 0.0973601 -0.138536 0.0953174 0.0131959 0.0296123 -0.0199925 -0.0029585 -0.0827041 -0.0268944 -0.1095738 -0.1229741 -0.1705212 -0.0521084 0.0415426 -0.0064109 0.0390672 0.0082879 0.0770969 0.0329454 0.0523462 unknown
polarizability: 132.7388515|6.9712336|115.1241618|-0.7891894|-11.5202983|95.7373976 unknown
InChI: InChI=1S/C9H10ClF3S/c10-8(11)6-4-1-2-5(3-4)7(6)14-9(8,12)13/h4-7H,1-3H2
charge 0 multiplicity 1
24 atoms
Cl -1.922756 -2.163701 0.841952
S  -0.795331 1.945984 -0.496975
F  -1.025473 -1.117662 -1.418093
F  -3.095647 0.512579 -0.732068
F  -2.351855 0.751133 1.404594
C  1.508601 -1.112601 -0.221224
C  0.317226 -0.454566 0.548354
C  1.983975 1.120328 -0.348714
C  0.650542 1.088633 0.437809
C  1.811277 -0.066859 -1.334095
C  2.766314 -0.969079 0.68794
C  3.080589 0.573653 0.624306
C  -1.078792 -0.738992 -0.032818
C  -1.924446 0.56541 0.046862
H  1.297972 -2.140423 -0.552294
H  0.301621 -0.766457 1.605522
H  2.221579 2.101956 -0.787663
H  0.711734 1.582106 1.419652
H  2.739297 -0.296734 -1.885428
H  0.988935 0.072606 -2.05204
H  3.601635 -1.561203 0.274648
H  2.584583 -1.325398 1.717632
H  3.03719 1.0588 1.616275
H  4.08573 0.763289 0.208664
