program: Gaussian 09
title: 000297699
version: EM64L-G09RevD.01
frameworkgroup: C1[X(C9H6Cl2O2)]
method: RPBEPBE
basis: SDD
operation: Freq
keyword: #p
keyword: freq=noraman
keyword: PBEPBE/SDD
title: #p freq=noraman PBEPBE/SDD
converged: NO YES NO NO
title: Mulliken charges:
elementType: Cl Cl O O C C C C C C C C C H H H H H H
charge: -0.017394 -0.042781 -0.226689 -0.190324 -0.532066 0.206616 -0.299400 0.227626 0.195894 -0.318167 -0.339636 -0.130089 -0.174316 0.318158 0.264270 0.227895 0.300113 0.265738 0.264554
chargesum: 0.00000
title: Mulliken charges with hydrogens summed into heavy atoms:
elementType: Cl Cl O O C C C C C C C C C
charge: -0.017394 -0.042781 -0.226689 -0.190324 -0.213908 0.206616 0.192764 0.227626 0.195894 -0.018055 -0.073899 -0.130089 0.090238
polarizability: 1.70093656e+02 -7.36101953e-01 1.21234438e+02 -7.83076535e+00 5.78285691e+00 7.34597767e+01
1716.lowfreq: -5.4157 -4.2485 -0.0030 -0.0025 -0.0007 7.7947 47.8955 84.4595 140.7597
frequency: 47.8692 84.4574 140.7573 158.0745 177.9719 187.8149 292.4081 329.1158 332.4009 341.1354 430.5601 459.0692 483.9976 511.5726 526.1042 569.3516 618.1351 686.4244 704.7860 762.4064 779.0480 820.3546 828.7852 896.8214 921.0117 961.4852 967.6242 1035.1805 1069.1804 1080.2074 1129.0129 1177.2092 1207.4401 1231.7524 1238.8377 1262.5766 1270.3474 1363.9535 1394.4463 1412.2902 1439.4290 1457.9034 1564.4708 1590.6068 1613.1142 2967.9527 3101.3138 3115.0994 3163.8542 3168.0061 3183.0749
redmass: 16.7451 7.1271 8.3836 10.8548 8.5712 10.1520 2.8443 7.1868 8.5153 5.6165 3.9981 8.0947 6.1947 6.4576 3.7243 6.6236 6.7325 5.2740 5.2155 4.6730 5.8627 4.4123 1.6386 3.5238 1.4706 1.3625 1.9828 3.9845 1.9875 3.0278 1.4525 1.1655 2.9324 1.3869 1.8287 1.6257 1.7453 1.4074 7.5803 4.8116 1.2713 1.9872 7.8039 10.3356 8.0088 1.0687 1.0881 1.0951 1.0889 1.0928 1.0977
irintensity: 2.1220 0.7003 1.6552 1.2013 1.6567 2.0453 4.9856 1.7899 5.1879 3.4282 0.2988 3.0725 10.9970 22.1500 18.9287 50.9185 17.0198 2.4512 2.6840 10.8416 5.6640 20.7714 44.6637 15.5299 9.7908 0.8231 21.2867 5.3982 12.1094 50.5049 26.6357 10.1978 53.4442 25.1599 60.4338 80.6440 31.5195 13.7275 8.8124 114.9568 8.7498 166.7910 1.2722 254.0037 16.3257 31.3847 2.9508 9.1308 0.7284 3.9624 2.4316
temp: 298.150 k
press: 1.00000 atm
elementType: 17 17 8 8 6 6 6 6 6 6 6 6 6 1 1 1 1 1 1
symmnumber: 1
zpe: 336490.4 jmol-1
zpe.correction: 0.128162 hartree
zpe.thermalcorrener: 0.139134 hartree
zpe.thermalcorrenthalpy: 0.140078 hartree
zpe.thermalcorrgfe: 0.090173 hartree
zpe.sumelectzpe: -1416.191610 hartree
zpe.sumelectthermal: -1416.180639 hartree
zpe.sumelectthermalent: -1416.179695 hartree
zpe.sumelectthermalfe: -1416.229600 hartree
dipole: 1.0698 3.4268 -1.8628
dipole: 4.0444
quadrupole: -85.9158 -92.2612 -88.2783
quadrupole: -0.3012 -7.6540 -1.6321
quadrupole: 2.9026 -3.4427 0.5401 -0.3012 -7.6540 -1.6321
hfenergy: -1416.3197729 hartree
pointgroup: C01 [X(C9H6Cl2O2)]
dipole: -0.3283288 -1.3471892 -0.7805238 debye
dipolederiv: -0.3255961 0.00801 0.1214686 -0.0508553 -0.1536631 0.0067076 0.2391815 -0.0710464 -0.4752113 -0.7382821 -0.2316492 -0.062971 -0.3291715 -0.2208508 -0.0259938 -0.0706362 -0.0211126 -0.0653865 -1.358684 -0.43281 -0.1986803 -0.312628 -0.4693202 -0.0998244 -0.17323 0.0060238 -0.2597017 -0.5760514 0.0783087 0.0191694 0.3496547 -0.9873041 0.1785096 -0.0417194 0.0981203 -0.3040788 0.0158394 -0.1446533 -0.086708 -0.0365817 0.0262737 0.0719988 -0.259598 0.0743916 0.6280365 -0.7929455 0.4792948 -0.0503388 0.1347008 -0.3556228 0.0172941 -0.0881025 0.1053126 -0.0390457 0.6977225 0.0543756 0.1416225 -0.2976113 0.1026743 -0.0475819 0.2821639 -0.0670812 0.2272076 1.116409 0.5160772 0.1398476 0.321266 0.3905718 0.1033159 0.1157451 0.0401675 0.1123848 1.2800119 -0.35998 -0.09753 -0.4808857 1.1134773 -0.2759735 0.0191517 -0.1930687 0.082622 -0.0160749 -0.3562202 0.0109522 0.0450186 -0.0334012 -0.0046419 -0.0171419 -0.0318501 -0.0371929 -0.3959406 -0.2106814 -0.0347473 0.0098251 0.1061892 -0.017656 -0.0545493 -0.0844915 -0.175171 0.9847449 0.5818825 0.1058023 0.6399943 -0.0219235 0.045354 0.1071495 0.0699287 -0.0843747 -0.0940664 0.0095994 0.0154269 -0.1292704 0.2030819 -0.018249 0.0175675 -0.0132442 -0.0623223 -0.0048027 0.0170096 -0.0151407 0.0718593 0.0733411 0.0286643 0.002867 0.023861 -0.0190568 -0.0411957 -0.0602647 -0.0213075 -0.0768944 0.0399358 0.0068526 0.0237509 0.0359853 0.1166265 0.0288425 0.0032577 0.0605746 0.1404462 0.0830804 0.0046226 -0.0554991 -0.0057476 -0.1252964 0.1272852 0.0159163 -0.0098168 -0.0413823 0.0526892 0.0017504 -0.0003836 0.0105062 0.1575788 0.0867043 -0.0301402 -0.0107238 -0.0066601 -0.0287029 0.0116435 -0.0223347 0.0023749 0.1683301 0.0060796 0.0626674 -0.0268998 0.0491757 0.0794737 0.0132071 -0.0243825 0.0209704 0.1540519 unknown
polarizability: 170.2754006|2.9427132|121.7997309|5.617241|-3.1727799|72.7127392 unknown
InChI: InChI=1S/C9H6Cl2O2/c10-5-1-2-8-6(3-5)9(12)7(11)4-13-8/h1-3,7H,4H2
charge 0 multiplicity 1
19 atoms
Cl -2.938802 0.233895 1.570406
Cl 4.079557 1.117378 0.308626
O  -1.151719 -1.809912 -0.264774
O  -1.203521 2.390998 -0.562249
C  -2.470925 0.324317 -0.270679
C  0.067156 0.353761 -0.207791
C  -2.304526 -1.082689 -0.833612
C  0.023987 -1.070978 -0.118588
C  -1.175016 1.142282 -0.37105
C  1.317659 1.021182 -0.084286
C  1.204805 -1.810471 0.12852
C  2.473733 0.272344 0.144508
C  2.432553 -1.139664 0.262391
H  -3.305821 0.859836 -0.747536
H  -3.175988 -1.719802 -0.622419
H  -2.154771 -1.007479 -1.932381
H  1.333735 2.11287 -0.156359
H  1.14649 -2.89983 0.201139
H  3.351516 -1.70304 0.448332
