program: Gaussian 09
title: 000297735
version: EM64L-G09RevD.01
frameworkgroup: C1[X(C19H24O)]
method: RPBEPBE
basis: SDD
operation: Freq
keyword: #pfreq=noraman
keyword: PBEPBE/SDD
title: #p freq=noraman PBEPBE/SDD
converged: NO YES NO NO
title: Mulliken charges:
elementType: O C C C C C C C C C C C C C C C C C C C H H H H H H H H H H H H H H H H H H H H H H H H
charge: -0.230714 0.454653 -0.109179 -0.100142 -0.110244 -0.524661 -0.528284 -0.522580 -0.450194 -0.451389 -0.450610 -0.690890 0.506287 -0.407128 -0.394086 -0.365756 -0.375608 0.295840 0.119796 -0.792333 0.197580 0.196742 0.195823 0.188331 0.223035 0.198819 0.200509 0.221337 0.187129 0.198049 0.191657 0.196488 0.195382 0.197889 0.191093 0.214090 0.212747 0.234640 0.238358 0.239138 0.275044 0.236812 0.236796 0.259736
chargesum: 0.00000
title: Mulliken charges with hydrogens summed into heavy atoms:
elementType: O C C C C C C C C C C C C C C C C C C C
charge: -0.230714 0.454653 0.088401 0.096599 0.085579 -0.113296 -0.128955 -0.114114 -0.060488 -0.059519 -0.061628 -0.264053 0.506287 -0.172488 -0.155728 -0.126619 -0.100563 0.295840 0.119796 -0.058989
polarizability: 2.66586444e+02 -1.97358503e+00 1.81481441e+02 -2.34693211e+01 -5.27282729e+00 1.52201528e+02
1716.lowfreq: -18.6810 -0.0006 -0.0003 0.0003 3.9888 8.7570 19.1913 39.0593 46.6333
frequency: 17.4216 38.8696 46.3874 73.2316 114.2886 145.3281 159.9655 183.9107 224.1241 260.9940 299.9637 317.0340 324.0781 364.3357 376.9329 392.8766 395.6324 405.5880 415.7631 427.3848 431.7483 456.7555 477.1798 562.2110 576.8393 610.6314 632.6068 639.4647 641.7356 682.5274 702.2642 751.7530 768.1944 799.9584 800.1724 820.5234 848.5764 866.7761 870.4235 872.7366 875.3870 879.9061 912.5644 944.1825 946.1063 954.3842 967.9024 974.2197 980.9835 982.0189 997.0722 1010.2586 1027.0966 1046.9873 1048.3106 1049.5760 1072.0445 1091.0219 1100.0092 1104.0060 1105.6609 1112.4654 1115.5952 1116.7225 1152.9285 1179.5367 1192.4395 1199.5495 1219.4695 1242.2351 1275.2461 1278.0206 1285.3140 1291.0854 1296.5250 1300.6597 1310.1013 1312.3717 1313.8819 1318.2585 1324.7448 1343.1420 1343.3999 1354.8276 1360.5762 1361.6433 1366.7598 1385.6425 1411.7122 1447.2858 1450.1349 1454.1314 1460.0263 1461.7449 1463.5656 1465.1861 1467.8679 1484.6618 1498.9987 1560.6444 1595.4662 1619.2081 2948.5878 2950.9005 2955.6404 2960.2332 2961.9888 2963.4337 2965.4129 2985.1075 2990.4633 2992.0029 3003.7682 3005.8083 3015.9094 3017.1541 3020.0239 3025.3844 3025.6573 3027.2980 3069.8733 3123.4778 3125.9405 3127.4544 3151.4519 3157.4242
redmass: 3.6844 4.8434 4.1514 3.8526 5.1799 1.0409 4.0695 3.6286 2.9365 5.4930 1.9709 2.4221 2.4532 2.1646 2.8380 4.3036 4.4874 2.9209 2.2127 1.7374 1.7906 3.2048 2.9359 4.1987 3.1958 2.4799 6.5454 3.7572 3.8830 3.8771 4.1237 3.8997 3.4823 2.8688 3.2056 2.5248 1.5696 1.5111 1.6850 1.5760 1.5639 1.6870 3.4280 2.1487 2.0916 1.9886 1.4403 2.0232 2.1886 2.2094 1.3707 3.1047 1.8227 1.8090 1.7782 1.7471 2.5214 2.1315 1.4207 1.3949 1.0206 1.0196 2.3855 1.2747 1.1252 1.2377 1.1303 1.0597 2.7443 1.3740 3.7661 1.8000 1.8478 1.8845 1.8072 2.1346 1.8336 1.5342 1.4366 1.3895 1.3121 1.4549 1.4583 1.4500 1.6271 1.6425 1.2672 3.8890 3.2146 1.0969 1.0834 1.0823 1.0967 1.0501 1.0911 1.0918 1.0998 1.0917 2.5684 6.3880 7.4079 6.5510 1.0597 1.0615 1.0626 1.0632 1.0613 1.0611 1.0590 1.0374 1.0839 1.0841 1.0839 1.1023 1.1007 1.1018 1.1023 1.1011 1.1005 1.1018 1.0969 1.0889 1.0980 1.0889 1.0946 1.0959
irintensity: 1.1593 0.0155 2.5036 2.2650 0.1812 0.5390 2.6445 0.3516 2.5907 0.3738 0.0032 0.3646 0.4915 0.2392 2.4321 0.0843 0.1108 0.0406 0.6704 0.0732 0.3658 4.0257 2.6931 15.0110 0.8273 25.2239 0.4479 0.1906 0.0758 7.7613 0.0560 0.9517 0.5694 1.3167 1.5324 11.3916 18.0789 18.0197 0.5106 3.6212 0.0152 0.3405 0.5298 31.2706 3.1514 6.8970 0.6830 6.5598 1.2263 2.7738 1.7290 5.5874 0.8630 0.1935 0.3019 0.1672 2.1984 11.0271 0.0538 4.9027 0.0637 0.0926 2.6874 13.2842 2.6257 2.7020 31.9051 0.8482 2.5745 1.7401 266.8078 0.2062 0.9948 0.0296 0.7157 19.6174 0.4760 2.6853 4.2540 4.2267 0.0008 2.9838 2.6117 7.6029 0.5868 1.4402 53.9901 8.7331 23.0431 30.1813 0.7864 1.2378 1.6326 20.5913 12.3378 15.2089 24.9780 0.4755 1.1191 75.4265 156.1119 35.3207 20.2064 25.8787 50.0712 28.4824 24.7141 14.7325 65.7874 3.6447 148.7950 144.2440 65.0375 16.2361 4.1792 3.0297 2.2197 64.4161 81.0785 106.0253 13.1912 19.3198 14.7924 11.4422 18.7131 2.5590
temp: 298.150 k
press: 1.00000 atm
elementType: 8 6 6 6 6 6 6 6 6 6 6 6 6 6 6 6 6 6 6 6 1 1 1 1 1 1 1 1 1 1 1 1 1 1 1 1 1 1 1 1 1 1 1 1
symmnumber: 1
zpe: 1002656.4 jmol-1
zpe.correction: 0.381892 hartree
zpe.thermalcorrener: 0.398906 hartree
zpe.thermalcorrenthalpy: 0.399850 hartree
zpe.thermalcorrgfe: 0.336411 hartree
zpe.sumelectzpe: -812.181556 hartree
zpe.sumelectthermal: -812.164542 hartree
zpe.sumelectthermalent: -812.163598 hartree
zpe.sumelectthermalfe: -812.227036 hartree
dipole: 3.1932 2.4458 -1.2059
dipole: 4.1992
quadrupole: -135.3440 -116.4128 -122.1845
quadrupole: -15.4321 4.1627 1.7229
quadrupole: -10.6969 8.2343 2.4626 -15.4321 4.1627 1.7229
hfenergy: -812.5634475 hartree
pointgroup: C01 [X(C19H24O1)]
dipole: -1.2624295 0.0941918 1.0614856 debye
polarizability: 265.5566728|23.454082|157.1571122|-11.1085745|11.0106783|177.5556279 unknown
InChI: InChI=1S/C19H24O/c1-13(20)18-4-2-14(3-5-18)9-19-10-15-6-16(11-19)8-17(7-15)12-19/h2-5,15-17H,6-12H2,1H3
charge 0 multiplicity 1
44 atoms
O  5.4713 0.402677 -1.482796
C  -1.654374 -0.60587 0.262342
C  -2.901163 0.483173 -1.685803
C  -4.213437 -0.465933 0.264903
C  -2.836505 1.639217 0.570253
C  -1.671537 -0.373193 -1.27728
C  -2.980894 -1.319785 0.666694
C  -1.608076 0.778952 0.974059
C  -4.207055 -0.247725 -1.272316
C  -2.829663 1.858227 -0.966995
C  -4.142248 0.90895 0.983636
C  -0.4567 -1.520004 0.69641
C  0.93498 -0.968742 0.435101
C  1.610323 -0.197126 1.418642
C  1.60489 -1.206797 -0.797592
C  2.895686 0.329357 1.181028
C  2.887033 -0.684135 -1.042187
C  3.552649 0.095702 -0.056895
C  4.921604 0.631405 -0.363701
C  5.644222 1.461007 0.6951
H  -2.891199 0.636063 -2.783249
H  -5.139496 -0.996534 0.563094
H  -2.780222 2.619266 1.084693
H  -1.703133 -1.352335 -1.800307
H  -0.739918 0.135431 -1.593878
H  -2.986972 -1.497976 1.762344
H  -3.03344 -2.313779 0.175607
H  -0.674525 1.311358 0.706259
H  -1.596581 0.631025 2.074613
H  -5.089708 0.350436 -1.575266
H  -4.277325 -1.22355 -1.794311
H  -1.910007 2.398263 -1.269784
H  -3.692649 2.487341 -1.264388
H  -5.024136 1.524342 0.714292
H  -4.166328 0.765653 2.083055
H  -0.573277 -2.490119 0.172016
H  -0.571328 -1.723314 1.780495
H  1.119116 -0.015215 2.381991
H  1.111656 -1.816362 -1.564054
H  3.386333 0.917745 1.963837
H  3.406801 -0.86611 -1.988942
H  5.788401 0.880733 1.62543
H  5.063153 2.365492 0.955215
H  6.626448 1.764484 0.302833
