program: Gaussian 09
title: 000297712
version: EM64L-G09RevD.01
frameworkgroup: C1[X(C14H11Cl2NO2)]
method: RPBEPBE
basis: SDD
operation: Freq
keyword: #p
keyword: freq=noraman
keyword: PBEPBE/SDD
title: #p freq=noraman PBEPBE/SDD
converged: YES YES NO NO
title: Mulliken charges:
elementType: Cl Cl O O N C C C C C C C C C C C C C C H H H H H H H H H H H
charge: -0.033389 0.013925 -0.336715 -0.270833 -0.349511 0.118539 0.433816 0.264736 -0.455524 -0.362210 -0.419246 -0.349675 -0.225674 -0.234242 -0.238830 0.302173 -0.463357 0.206056 -0.462903 0.238905 0.253210 0.239153 0.302354 0.229289 0.228459 0.228827 0.259772 0.262518 0.334943 0.285434
chargesum: 0.00000
title: Mulliken charges with hydrogens summed into heavy atoms:
elementType: Cl Cl O O N C C C C C C C C C C C C C C
charge: -0.033389 0.013925 -0.336715 -0.270833 -0.014568 0.118539 0.433816 0.264736 -0.216620 -0.109000 -0.180093 -0.047321 0.003615 -0.005783 -0.010003 0.302173 0.058933 0.206056 -0.177468
polarizability: 2.38248298e+02 1.57094154e+01 2.16753043e+02 1.34161717e+01 -2.85573429e+00 1.07834369e+02
1716.lowfreq: 0.0004 0.0006 0.0016 3.9976 4.5157 9.8783 12.3928 19.1008 28.9180
frequency: 12.2087 19.0929 28.8968 47.7313 57.9409 93.6402 140.4822 159.5863 173.7027 176.5800 195.0477 251.5670 261.4140 270.6284 339.0688 373.1537 417.0976 420.0865 441.4177 469.1412 508.8276 510.6482 546.6112 560.6770 567.2320 604.8139 631.0377 635.8782 672.6954 693.9255 724.0988 748.2054 773.2004 783.7580 784.6306 786.7078 814.9186 830.5263 882.3714 893.3891 921.7958 966.9801 984.4924 995.2131 997.9559 1021.8266 1036.8201 1067.4431 1081.1194 1118.8529 1146.9219 1171.0781 1180.8308 1187.8862 1220.0401 1229.8227 1237.8821 1264.1126 1277.4881 1358.8896 1375.2858 1403.9159 1422.8121 1433.0060 1441.0617 1451.1134 1476.0164 1515.0616 1580.8817 1598.3600 1637.1999 1648.8917 1668.3581 3023.3703 3090.2640 3123.8872 3130.7550 3137.4798 3156.0081 3157.5966 3176.6951 3191.6683 3208.0941 3578.1979
redmass: 7.2634 9.1123 12.0877 10.3440 7.7209 6.1470 5.0444 19.5205 5.9848 4.2288 6.9671 6.3434 7.1560 4.9523 2.8485 4.2596 3.2724 4.2476 5.2146 3.3295 7.1824 7.1352 1.3290 5.8098 3.2947 5.2515 4.9758 3.5528 5.6978 11.1452 6.2821 1.3236 5.2264 3.4693 1.9706 1.5773 1.5232 4.4327 1.6443 4.4093 1.3896 1.3680 1.3509 1.3368 3.8115 2.7413 2.6583 2.8747 3.0012 3.7038 1.5182 1.1519 1.9352 1.4236 1.6989 1.2842 1.9977 1.6565 1.2116 1.2365 2.1054 3.5517 4.5931 1.1643 2.4106 2.4002 1.7694 3.8657 7.4389 5.6685 7.0211 8.4045 9.6216 1.0603 1.1029 1.0863 1.0872 1.0901 1.0968 1.0964 1.0968 1.0938 1.0940 1.0779
irintensity: 0.1682 0.0588 1.0318 6.6514 0.5985 2.1729 0.2454 0.9840 1.0052 2.5183 0.7679 1.8588 8.7562 0.4812 2.9830 18.7227 4.6774 3.6171 28.2601 0.1048 0.1777 0.9433 95.6446 24.8519 7.0990 52.8052 12.3576 1.7429 15.1763 32.3297 14.5462 1.5443 38.7986 6.3367 64.3036 46.7015 92.0436 14.0436 6.7198 43.9839 0.9921 0.9434 5.9946 0.0936 4.3158 58.5361 77.7315 35.8696 11.3515 176.7836 101.1941 80.7156 637.4047 32.0283 53.2149 10.3899 11.6600 7.1887 80.1305 3.8471 66.5333 32.8849 23.4592 42.6954 27.8528 74.7663 375.7957 13.2426 27.1690 13.2759 0.2597 56.5981 160.2294 24.1508 1.9265 0.9995 2.3276 14.3608 30.1896 31.2107 16.1836 10.0965 4.1925 36.0290
temp: 298.150 k
press: 1.00000 atm
elementType: 17 17 8 8 7 6 6 6 6 6 6 6 6 6 6 6 6 6 6 1 1 1 1 1 1 1 1 1 1 1
symmnumber: 1
zpe: 570595.2 jmol-1
zpe.correction: 0.217328 hartree
zpe.thermalcorrener: 0.234575 hartree
zpe.thermalcorrenthalpy: 0.235519 hartree
zpe.thermalcorrgfe: 0.167912 hartree
zpe.sumelectzpe: -1664.060841 hartree
zpe.sumelectthermal: -1664.043594 hartree
zpe.sumelectthermalent: -1664.042650 hartree
zpe.sumelectthermalfe: -1664.110257 hartree
dipole: 1.0408 1.0116 -1.8750
dipole: 2.3711
quadrupole: -117.8932 -115.4944 -124.9613
quadrupole: 1.7000 12.4943 -2.6790
quadrupole: 1.5564 3.9552 -5.5117 1.7000 12.4943 -2.6790
hfenergy: -1664.2781692 hartree
pointgroup: C01 [X(C14H11Cl2N1O2)]
dipole: -0.2919669 0.0605077 -0.8839395 debye
polarizability: 232.8398091|19.4333788|182.3546977|4.6733314|55.5775301|147.6412035 unknown
InChI: InChI=1S/C14H11Cl2NO2/c15-8-11(16)9-17-14(18)19-13-7-3-5-10-4-1-2-6-12(10)13/h1-8,17H,9H2
charge 0 multiplicity 1
30 atoms
Cl 5.099865 -1.10751 -0.151549
Cl 5.799185 0.245354 2.836957
O  0.164491 0.294572 -0.407192
O  1.308007 2.082074 0.69417
N  2.342596 0.660444 -0.85116
C  -2.062113 -0.56738 -0.266162
C  -3.425995 -0.48615 0.215833
C  -1.143158 0.46538 0.137993
C  -3.811867 0.60181 1.067069
C  -1.684143 -1.658675 -1.114745
C  -4.357273 -1.504689 -0.17511
C  -1.529978 1.520329 0.967693
C  -2.882216 1.575392 1.429876
C  -2.616843 -2.634447 -1.475388
C  -3.965079 -2.55824 -1.002977
C  1.276534 1.111663 -0.100552
C  3.673375 1.25328 -0.67863
C  4.521049 0.541693 0.361981
C  4.81144 1.056881 1.575686
H  -4.845522 0.654847 1.427158
H  -0.653021 -1.714547 -1.472981
H  -5.388817 -1.440502 0.191086
H  -0.810202 2.283648 1.263362
H  -3.177216 2.404982 2.081108
H  -2.316747 -3.465165 -2.123446
H  -4.686377 -3.329872 -1.293368
H  3.534209 2.302654 -0.367765
H  4.198176 1.244621 -1.650288
H  2.220609 -0.179007 -1.418223
H  4.42883 2.03156 1.886963
