program: Gaussian 09
title: 000297719
version: EM64L-G09RevD.01
frameworkgroup: C1[X(C12H14Br2N2O)]
method: RPBEPBE
basis: SDD
operation: Freq
keyword: #p
keyword: freq=noraman
keyword: PBEPBE/SDD
title: #p freq=noraman PBEPBE/SDD
converged: YES YES NO NO
title: Mulliken charges:
elementType: Br Br O N N C C C C C C C C C C C C H H H H H H H H H H H H H H
charge: 0.042760 0.079989 -0.274830 -0.514969 -0.403094 0.169187 0.368241 0.335789 -0.411476 -0.419716 -0.234737 -0.827530 -0.843788 0.295954 -0.444676 0.137889 -0.561558 0.231501 0.231526 0.294626 0.225126 0.217303 0.284634 0.217740 0.252840 0.217876 0.239241 0.296293 0.291670 0.236845 0.269344
chargesum: 0.00000
title: Mulliken charges with hydrogens summed into heavy atoms:
elementType: Br Br O N N C C C C C C C C C C C C
charge: 0.042760 0.079989 -0.274830 -0.220344 -0.106800 0.169187 0.368241 0.335789 -0.179975 -0.188189 -0.009611 -0.107853 -0.133831 0.295954 0.083839 0.137889 -0.292215
polarizability: 2.68953068e+02 -7.93767996e+00 1.78332699e+02 -2.51522491e+01 -7.33544549e-01 1.04597933e+02
1716.lowfreq: -6.5239 -3.2776 -0.0006 -0.0003 0.0002 3.7532 12.5878 19.4015 30.3254
frequency: 11.9955 19.3777 30.2627 52.0740 66.3245 94.0464 106.2426 138.9528 160.0546 169.2556 181.3243 198.3516 215.4095 230.1596 278.2415 287.8160 312.4551 326.4085 363.0506 406.4810 420.9819 466.4391 474.7384 509.0065 515.3044 530.0808 539.0393 562.9768 579.4876 680.4771 695.4862 715.8696 722.8874 759.0125 766.3353 777.2729 841.8540 898.4728 915.4846 944.3091 973.4834 985.6796 1017.3315 1038.4045 1043.7456 1050.4285 1052.8857 1094.7450 1129.2867 1176.8083 1199.4907 1211.3095 1236.5868 1246.5743 1261.0021 1282.7288 1340.1849 1368.6123 1397.1175 1398.4528 1436.4099 1450.4111 1458.0531 1460.3734 1464.5689 1471.4427 1480.0602 1488.2560 1498.4925 1604.1218 1607.8112 1612.1197 1645.6472 2955.5468 2971.4537 2978.2833 3033.7675 3042.7429 3060.1669 3086.1637 3088.7404 3121.4342 3130.9096 3157.1448 3165.3012 3515.2479 3555.7219
redmass: 7.2198 15.4848 5.1607 6.0490 5.6005 4.3325 30.0596 5.3498 3.4439 1.2311 1.2475 3.6439 4.0187 2.7516 3.4400 3.2071 2.9480 2.7687 2.2729 3.4604 2.0769 3.0676 6.2496 3.2695 3.0746 3.1341 2.8333 2.4234 3.9604 5.5561 5.7507 4.2173 5.3031 3.2914 1.5283 1.2240 4.7304 1.3106 2.9581 2.6013 1.3416 1.6226 2.6210 1.7799 1.7162 2.4580 1.9793 1.8843 3.6351 1.1604 1.4241 1.4878 3.5132 1.2114 1.6877 2.4771 1.2639 6.0013 1.2511 1.2559 1.8945 1.6558 1.3180 1.0919 1.4684 1.0853 1.5221 1.3131 1.6673 6.0609 6.2529 8.2230 5.1979 1.0431 1.0629 1.0364 1.0918 1.0972 1.0971 1.0997 1.0971 1.0857 1.0919 1.0994 1.0925 1.0755 1.0776
irintensity: 0.1644 0.0751 1.1332 0.7699 2.0422 7.9280 0.4023 2.9037 0.1042 0.7980 2.9436 4.8129 9.1441 5.6110 1.1327 3.5308 1.2372 6.5076 8.7744 37.8183 15.8063 5.9981 22.5147 23.4720 1.8355 44.0232 69.3766 75.6473 32.8658 1.8462 19.2520 24.2664 44.2964 13.2009 29.2706 58.9697 1.4464 0.2462 12.7108 18.4093 0.3854 5.9745 0.9816 4.2811 4.4111 20.8288 21.2993 29.1235 6.8522 5.6083 74.3307 314.2066 59.4470 41.1130 15.0819 33.2785 4.3060 38.1910 31.0624 3.6581 14.6527 46.5328 32.3527 24.1565 72.3355 13.9406 397.4247 32.2398 285.9342 6.9140 5.3113 29.8472 142.2199 37.7745 54.4771 26.6369 20.5600 14.2654 11.7727 24.1713 21.7658 0.2303 26.4219 35.5769 16.5529 12.7286 16.9259
temp: 298.150 k
press: 1.00000 atm
elementType: 35 35 8 7 7 6 6 6 6 6 6 6 6 6 6 6 6 1 1 1 1 1 1 1 1 1 1 1 1 1 1
symmnumber: 1
zpe: 622112.3 jmol-1
zpe.correction: 0.236950 hartree
zpe.thermalcorrener: 0.255390 hartree
zpe.thermalcorrenthalpy: 0.256334 hartree
zpe.thermalcorrgfe: 0.186007 hartree
zpe.sumelectzpe: -676.065685 hartree
zpe.sumelectthermal: -676.047245 hartree
zpe.sumelectthermalent: -676.046301 hartree
zpe.sumelectthermalfe: -676.116628 hartree
dipole: -0.0538 -0.4636 -4.0076
dipole: 4.0347
quadrupole: -120.8400 -109.6215 -121.8251
quadrupole: -8.0111 1.3530 2.0281
quadrupole: -3.4111 7.8074 -4.3963 -8.0111 1.3530 2.0281
hfenergy: -676.3026355 hartree
pointgroup: C01 [X(C12H14Br2N2O1)]
dipole: 0.069661 0.3075584 1.5557411 debye
polarizability: 271.6128484|5.8718588|177.1095479|15.7515134|-7.8303611|103.1613037 unknown
InChI: InChI=1S/C12H14Br2N2O/c1-8-4-3-5-9(2)11(8)16-12(17)15-7-10(14)6-13/h3-6,15-16H,7H2,1-2H3
charge 0 multiplicity 1
31 atoms
Br 3.519222 -1.524622 -1.06501
Br 6.757465 -0.413214 -0.051258
O  0.084849 0.970533 -1.472913
N  -0.565588 0.124615 0.634982
N  1.631824 0.86111 0.279622
C  -1.957146 -0.107568 0.36143
C  -2.811564 0.958321 -0.04586
C  -2.4607 -1.427931 0.565771
C  -4.179354 0.662624 -0.272722
C  -3.836299 -1.672126 0.348977
C  -4.694311 -0.635784 -0.078668
C  -2.303901 2.374739 -0.216708
C  -1.536046 -2.554715 0.994761
C  0.353976 0.67036 -0.273433
C  2.752506 1.265697 -0.565528
C  3.929539 0.302114 -0.508711
C  5.168216 0.687473 -0.118561
H  -4.846183 1.472564 -0.590973
H  -4.229556 -2.68408 0.501038
H  -0.181416 -0.364407 1.447004
H  -5.756611 -0.838103 -0.253839
H  -1.610076 2.654526 0.598039
H  -1.74022 2.475384 -1.162175
H  -3.140946 3.093431 -0.223547
H  -0.649288 -2.623132 0.336634
H  -1.167346 -2.427836 2.033991
H  -2.060546 -3.523979 0.959666
H  1.794895 0.729649 1.278539
H  2.349365 1.327817 -1.594078
H  3.120416 2.274996 -0.290247
H  5.366123 1.716745 0.19728
