program: Gaussian 09
title: 000297696
version: EM64L-G09RevD.01
frameworkgroup: C1[X(C11H11NO3)]
method: RPBEPBE
basis: SDD
operation: Freq
keyword: #p
keyword: freq=noraman
keyword: PBEPBE/SDD
title: #p freq=noraman PBEPBE/SDD
converged: YES YES NO NO
title: Mulliken charges:
elementType: O O O N C C C C C C C C C C C H H H H H H H H H H H
charge: -0.303417 -0.258972 -0.446461 -0.397697 0.278302 0.211518 0.223705 -0.437640 0.130585 -0.357698 -0.397539 -0.351458 -0.231269 -0.209083 -0.313424 0.293174 0.228840 0.237126 0.251101 0.337999 0.255070 0.230576 0.223388 0.231163 0.233264 0.338848
chargesum: 0.00000
title: Mulliken charges with hydrogens summed into heavy atoms:
elementType: O O O N C C C C C C C C C C C
charge: -0.303417 -0.258972 -0.107613 -0.059698 0.278302 0.211518 0.223705 -0.144467 0.130585 0.108268 -0.146438 -0.096388 -0.000692 0.024181 0.141127
polarizability: 2.24103201e+02 -1.07669177e+01 1.32515010e+02 1.33837931e+01 1.12403155e+01 7.03187556e+01
1716.lowfreq: -2.7806 -0.0004 -0.0003 0.0004 5.4078 8.6874 30.2120 42.3009 70.0399
frequency: 30.0349 42.2750 70.0137 88.3929 113.6327 139.3994 231.1264 250.7190 270.7184 290.5006 316.3618 345.1085 367.7706 428.2316 492.0691 528.7004 563.0017 573.1253 582.7150 605.0214 615.4952 728.1897 742.0153 749.5870 757.1031 794.5676 845.8663 854.8431 860.9576 875.6370 880.8798 904.1335 945.0351 983.3260 997.7177 1006.2149 1026.3584 1080.5380 1098.6898 1123.3775 1154.1821 1161.3025 1177.5793 1200.5502 1250.0393 1258.8469 1279.6359 1312.2609 1330.9046 1352.3148 1372.2285 1412.0194 1428.4092 1434.6608 1465.2219 1468.2811 1488.6491 1583.3241 1596.5878 1597.7190 1623.1653 2995.6117 3010.9060 3080.9937 3091.8637 3138.2562 3151.1865 3166.0392 3178.2973 3239.1910 3545.8329 3558.8135
redmass: 4.8695 6.1283 5.5485 4.4462 5.3416 2.9396 4.5420 4.3866 4.9579 5.5045 1.2348 4.9680 2.6554 3.0375 3.2532 3.6433 4.3850 6.0569 4.3989 6.7305 1.1386 5.4857 4.7404 4.3110 1.2616 3.9286 3.5998 1.3321 3.9424 2.9609 1.5145 4.6876 1.3871 1.3136 2.4182 2.1363 2.9990 1.9707 2.2950 2.6273 1.8577 1.1948 1.2795 2.0512 1.8016 2.0096 1.7253 2.0562 1.1672 1.3110 1.2124 4.5327 1.1898 2.6552 2.7575 1.0842 1.9624 7.7334 7.2466 6.9344 7.8493 1.0646 1.0599 1.1015 1.1032 1.0859 1.0907 1.0963 1.0993 1.0988 1.0783 1.0659
irintensity: 1.4749 0.4612 9.2047 1.9532 2.6709 7.6848 9.0836 3.2307 4.1766 11.9700 159.3907 17.9684 53.7316 9.9968 2.4065 0.2189 0.8472 0.9579 0.6187 5.4410 72.5667 13.0976 7.8882 3.8724 92.2728 15.3858 40.1544 9.2951 16.9402 3.8708 22.3220 8.4043 6.5211 0.0090 77.4888 7.3367 16.9480 2.6288 14.3472 6.1450 49.7110 5.3034 29.6571 19.5751 31.2153 12.8702 79.8149 17.3256 21.8696 6.8224 20.3957 10.7976 40.6686 13.1702 15.1948 8.8862 244.0430 73.1991 42.9214 195.4945 5.6833 32.5027 32.1513 14.9036 44.2375 1.3821 8.7005 19.8387 13.4785 2.1399 30.0954 3.9118
temp: 298.150 k
press: 1.00000 atm
elementType: 8 8 8 7 6 6 6 6 6 6 6 6 6 6 6 1 1 1 1 1 1 1 1 1 1 1
symmnumber: 1
zpe: 528177.2 jmol-1
zpe.correction: 0.201172 hartree
zpe.thermalcorrener: 0.214500 hartree
zpe.thermalcorrenthalpy: 0.215444 hartree
zpe.thermalcorrgfe: 0.159739 hartree
zpe.sumelectzpe: -705.105865 hartree
zpe.sumelectthermal: -705.092538 hartree
zpe.sumelectthermalent: -705.091593 hartree
zpe.sumelectthermalfe: -705.147298 hartree
dipole: 3.4029 -1.5320 -0.8957
dipole: 3.8379
quadrupole: -82.5974 -89.1503 -89.1450
quadrupole: -1.4465 7.9216 4.4254
quadrupole: 4.3669 -2.1861 -2.1808 -1.4465 7.9216 4.4254
hfenergy: -705.3070374 hartree
pointgroup: C01 [X(C11H11N1O3)]
dipole: 1.3381433 -0.5614524 -0.4171932 debye
dipolederiv: -0.793089 0.1559537 -0.0159194 -0.0675623 -0.5264557 -0.1344514 -0.0995648 -0.1072999 -0.1806853 -0.890583 0.2324897 0.0185554 0.1090488 -0.886822 -0.1088305 -0.0173886 -0.1302692 -0.385381 -0.2277312 0.1144743 0.0981019 -0.0194241 -0.6705555 0.1705599 0.2221954 0.1577608 -0.6854551 -1.0703166 -0.2722089 -0.0550163 -0.6200347 -0.7104207 -0.0759197 -0.1309722 -0.0486308 -0.5328947 -0.045294 0.0147378 0.0026183 -0.1264035 -0.1217205 -0.0602684 -0.0466112 -0.0435435 0.0015441 0.4574834 -0.1072137 0.0136525 0.135892 0.0419662 0.0060251 0.0876467 -0.0205586 0.0703517 -0.6786865 0.0918973 -0.041787 -0.1048407 0.4456079 0.1308363 -0.1111284 0.1487129 0.0538936 0.1358065 -0.1728089 -0.0262646 -0.0076526 0.0071663 0.0485845 0.0327841 0.0312755 -0.1413344 1.9725312 0.0124681 0.1475736 0.3471061 1.2073805 0.2661382 0.2780716 0.2898569 0.3208118 0.6284689 0.049425 0.0782329 0.0206756 0.1233062 -0.0228338 0.1510157 0.0858909 0.1488197 0.1647051 -0.0316697 0.0219734 0.0576322 0.1065728 0.0886926 0.0543046 0.0794792 -0.1233303 -0.0731967 -0.0157582 0.0045806 -0.0431065 0.0462651 0.0662208 -0.0028099 0.0663744 -0.144656 0.066472 0.0541273 0.0451123 0.217787 -0.1455346 0.0262051 0.0958872 0.0126376 -0.1520555 -0.115724 0.00979 0.0140712 -0.0778325 0.0809376 0.070675 -0.0193665 0.07984 -0.1405437 0.2313975 -0.0904342 -0.0100239 0.0205588 0.5368676 -0.1194147 -0.140176 -0.2189124 0.3853592 0.1130783 0.0227755 -0.0020476 0.0468555 0.0574978 -0.0368564 0.0057226 -0.0380352 0.1720314 -0.0281939 -0.0271706 0.0018261 -0.0608167 0.0119328 -0.1425618 -0.0427814 -0.0955271 -0.0183878 0.0024767 -0.0285121 0.0014466 0.0909908 -0.0427168 0.1150608 -0.0096907 0.0601684 0.0518729 0.0711832 -0.0205858 -0.0173218 -0.0606673 -0.0417991 -0.0723999 -0.0299557 -0.0683128 0.1395313 0.1881447 0.0049429 -0.013508 0.099257 0.1829711 -0.0366323 -0.02363 -0.0477169 0.3099403 0.084996 -0.0548512 -0.0289591 -0.0149515 -0.0120704 -0.0644387 -0.016342 -0.0682006 0.1583836 -0.1256127 -0.0300857 -0.0419249 -0.0286324 0.0904771 -0.0274566 -0.04246 -0.0274742 0.1519242 -0.1981126 0.0291857 -0.0434094 -0.0264632 0.0522277 0.02694 -0.005586 0.0509437 0.0778446 0.1036689 -0.0537339 -0.0519347 -0.0037434 -0.1070631 -0.064632 -0.0304694 -0.058415 -0.0551487 -0.0170411 0.1033032 0.0131613 0.1019624 -0.0021109 -0.0418623 0.0121295 -0.0413128 0.1519441 0.0431689 0.0094624 -0.1127893 0.0143652 0.2760927 -0.0073797 -0.1708246 -0.0487313 0.36562 unknown
polarizability: 224.6559053|-10.6143547|130.2417882|10.0948647|16.0934234|72.0392732 unknown
InChI: InChI=1S/C11H11NO3/c13-6-5-12-11(14)10-7-8-3-1-2-4-9(8)15-10/h1-4,7,12-13H,5-6H2
charge 0 multiplicity 1
26 atoms
O  0.314844 -0.67666 -0.406326
O  -2.173684 1.961925 0.136964
O  -4.431104 -1.731219 1.064055
N  -2.379626 -0.254628 -0.590593
C  2.072638 0.701291 0.235159
C  1.712674 -0.602984 -0.223254
C  -0.188375 0.617137 -0.051044
C  0.838471 1.457169 0.334726
C  -1.649287 0.839754 -0.154648
C  -3.836547 -0.170256 -0.792692
C  3.441576 0.982687 0.481974
C  2.630505 -1.637643 -0.448857
C  4.384819 -0.041469 0.262273
C  3.987115 -1.331704 -0.19594
C  -4.62613 -0.381522 0.515765
H  0.70558 2.490002 0.648445
H  -4.126142 -0.943555 -1.525407
H  -4.079931 0.827469 -1.203069
H  3.757264 1.970102 0.833699
H  -1.875032 -1.105289 -0.849169
H  2.313637 -2.623146 -0.800647
H  5.44691 0.152555 0.445659
H  -5.70688 -0.309603 0.310392
H  -4.346385 0.400072 1.249365
H  4.748152 -2.102794 -0.355879
H  -3.494261 -1.80749 1.377649
