program: Gaussian 09
title: 000297859
version: EM64L-G09RevD.01
frameworkgroup: C1[X(C19H20N2O5)]
method: RPBEPBE
basis: SDD
operation: Freq
keyword: #p
keyword: freq=noraman
keyword: PBEPBE/SDD
title: #p freq=noraman PBEPBE/SDD
converged: YES YES NO NO
title: Mulliken charges:
elementType: O O O O O N N C C C C C C C C C C C C C C C C C C C H H H H H H H H H H H H H H H H H H H H
charge: -0.285794 -0.294473 -0.277885 -0.235461 -0.319193 -0.379960 -0.360083 0.455349 -0.453883 0.458105 -0.417429 -0.454069 -0.517369 0.250903 -0.370721 -0.433363 0.246928 -0.352210 -0.409890 -0.238265 -0.218133 -0.216754 -0.237324 0.335784 -0.237969 -0.243001 0.262270 0.246151 0.275294 0.267091 0.241900 0.238858 0.257534 0.255550 0.406982 0.299922 0.237124 0.247155 0.240624 0.335599 0.230959 0.228488 0.230369 0.240857 0.229356 0.234074
chargesum: 0.00000
title: Mulliken charges with hydrogens summed into heavy atoms:
elementType: O O O O O N N C C C C C C C C C C C C C C C C C C C
charge: -0.285794 -0.294473 -0.277885 -0.235461 -0.319193 0.027022 -0.024484 0.455349 0.054539 0.458105 0.124957 0.026689 -0.004285 0.250903 -0.070799 -0.196239 0.246928 -0.105055 -0.169266 -0.007306 0.010355 0.013614 0.003533 0.335784 -0.008613 -0.008927
polarizability: 2.68320351e+02 -9.01250351e+00 1.84511417e+02 2.36351273e+00 7.55036846e-01 2.20058685e+02
1716.lowfreq: -6.4137 -3.9682 -3.4539 0.0002 0.0006 0.0009 8.5817 13.0325 15.0455
frequency: 5.8606 12.6855 14.2668 20.5966 32.9425 39.9242 46.9291 57.3822 62.0041 70.8196 88.5477 100.1615 155.4280 161.5232 172.1903 186.9779 207.1100 235.4918 239.0488 272.5674 292.9090 319.6892 330.7640 356.0740 390.2356 401.1073 405.4600 447.2561 464.9060 481.4195 515.2313 539.4193 550.9105 575.8200 590.6448 602.3195 615.1057 616.0377 627.6934 642.7651 695.3168 701.3598 707.3229 735.8521 744.2679 751.4608 764.0263 799.2818 806.7898 815.1457 836.0005 856.5002 865.0409 910.0776 916.2875 927.4415 935.4044 948.0205 979.7066 982.3838 985.2756 986.7949 988.8456 990.0593 995.9035 998.9376 1004.2725 1012.5169 1026.0991 1027.7698 1087.9670 1092.1424 1100.3247 1121.3025 1173.4940 1173.6815 1184.7317 1188.0739 1195.4262 1205.7618 1212.2352 1214.9928 1217.4221 1241.7766 1245.2499 1251.3834 1278.3843 1319.5097 1324.2201 1326.9759 1338.4509 1350.4294 1351.8568 1385.5168 1386.8051 1438.8926 1439.6093 1439.9194 1453.7557 1460.1386 1465.4700 1484.4524 1485.8329 1487.3557 1507.0145 1594.1464 1595.0285 1614.5415 1615.1576 1618.7037 1645.0379 1654.6360 2992.0294 3020.3044 3022.7220 3025.6547 3032.2106 3091.5854 3093.0978 3113.1000 3120.9942 3122.8483 3126.8725 3129.4310 3137.8577 3139.9004 3148.1284 3150.0506 3163.0540 3165.6110 3423.7007 3576.7741
redmass: 6.0105 5.5491 5.0078 5.0150 7.2047 6.3616 4.2626 5.8158 5.0263 4.4539 7.6282 5.7516 5.4303 4.8628 4.1958 4.7444 4.2901 6.1277 7.0065 5.2307 3.6527 2.6414 2.3355 4.8113 4.1413 2.8194 2.8717 3.9904 3.3077 4.5731 3.4105 3.6998 1.2385 4.5902 4.7507 4.6198 6.1505 6.3123 5.3927 4.5281 7.3129 2.1080 2.2296 2.6100 1.6141 1.8592 1.4224 4.6574 3.8328 3.7771 3.5338 1.2553 1.2545 5.7526 1.4127 1.4220 5.2657 4.8195 1.4056 2.1990 2.2080 1.4817 4.0459 5.8347 1.7740 1.5092 1.9113 1.4927 2.1970 2.2226 1.5571 1.5951 5.0132 5.4729 1.0554 1.0559 2.5306 1.1502 1.2186 1.3653 1.8417 2.3726 1.6886 1.4655 1.2651 1.5849 1.4591 1.3008 1.4601 1.3516 1.3096 1.3571 1.3529 6.2881 5.5006 1.8983 1.1457 1.9820 1.2000 1.0776 1.1385 2.2614 1.8626 2.2461 1.9996 5.9991 6.0789 6.0585 5.9202 8.3572 7.1653 9.9268 1.0599 1.0631 1.0569 1.0575 1.0997 1.1077 1.1075 1.1010 1.0853 1.0855 1.0879 1.0873 1.0924 1.0923 1.0967 1.0966 1.1017 1.1016 1.0811 1.0779
irintensity: 0.4327 0.2751 0.3102 0.3351 0.5392 1.0471 1.0127 5.0881 2.0570 1.0484 4.4473 9.3507 0.5319 0.3079 1.4911 4.5709 12.8499 5.7203 5.6466 4.8477 10.1450 7.3256 23.5341 0.8612 9.4305 0.7087 0.7389 7.3449 30.6448 7.9527 11.9448 8.3199 106.4775 21.8523 10.4690 2.1393 3.9938 0.1202 5.5970 2.2838 16.7246 64.1471 15.1462 83.8339 13.8295 36.9556 115.5791 13.3467 4.1804 11.8695 20.8223 3.0628 0.8129 12.5899 8.9710 0.5889 179.8934 31.7918 0.7404 1.0293 2.2133 1.0951 0.8440 0.2906 7.8069 9.6990 16.2574 6.0152 3.7474 4.0378 9.3498 5.7353 91.0020 70.4492 0.1149 0.1602 165.2750 19.1516 16.4234 80.7505 4.3145 16.4789 224.3096 12.8427 4.6014 88.3106 58.7946 6.1586 2.2133 8.4490 4.6099 8.2410 5.0645 0.9469 1.6938 5.2443 28.0631 6.9214 18.0944 15.9019 15.0741 15.5848 261.1307 17.8635 321.4008 2.2047 1.9887 1.2776 3.3282 119.9002 395.2851 205.8202 18.7192 17.2390 12.2352 30.0423 6.1052 1.5995 5.0132 6.4418 2.7198 2.2293 6.1351 0.4136 22.9489 8.9035 16.7992 30.6073 33.5086 15.1726 168.4079 52.5132
temp: 298.150 k
press: 1.00000 atm
elementType: 8 8 8 8 8 7 7 6 6 6 6 6 6 6 6 6 6 6 6 6 6 6 6 6 6 6 1 1 1 1 1 1 1 1 1 1 1 1 1 1 1 1 1 1 1 1
symmnumber: 1
zpe: 947479.0 jmol-1
zpe.correction: 0.360876 hartree
zpe.thermalcorrener: 0.385524 hartree
zpe.thermalcorrenthalpy: 0.386468 hartree
zpe.thermalcorrgfe: 0.299142 hartree
zpe.sumelectzpe: -1219.786774 hartree
zpe.sumelectthermal: -1219.762126 hartree
zpe.sumelectthermalent: -1219.761182 hartree
zpe.sumelectthermalfe: -1219.848508 hartree
dipole: -0.4911 5.0137 -2.2295
dipole: 5.5090
quadrupole: -140.3573 -163.7913 -146.4076
quadrupole: 9.2447 -3.5487 12.3932
quadrupole: 9.8281 -13.6059 3.7778 9.2447 -3.5487 12.3932
hfenergy: -1220.14765 hartree
pointgroup: C01 [X(C19H20N2O5)]
dipole: -1.9213918 0.7154527 0.7028195 debye
polarizability: 183.9301523|5.8173774|267.2762196|-0.7342026|-8.9830238|221.6840809 unknown
InChI: InChI=1S/C19H20N2O5/c22-17(11-21-19(24)26-14-16-9-5-2-6-10-16)20-12-18(23)25-13-15-7-3-1-4-8-15/h1-10,20-21H,11-14H2
charge 0 multiplicity 1
46 atoms
O  1.264657 0.049667 -1.064928
O  -2.158805 -2.084361 1.869497
O  2.786446 -4.245361 0.435853
O  2.974265 -0.012299 -2.662622
O  -0.140827 -0.855348 1.97082
N  2.082397 -2.029105 0.275369
N  -0.178733 -3.196329 1.977712
C  1.036907 2.461118 -0.583229
C  0.744907 1.358711 -1.580445
C  -3.128687 -0.386209 0.308759
C  2.814806 -1.783311 -0.96796
C  -2.929519 -0.809161 1.751739
C  1.270139 -3.365551 2.174135
C  2.112034 -3.263619 0.878228
C  0.722532 2.289646 0.791278
C  1.600552 3.683761 -1.022249
C  2.391547 -0.498496 -1.669922
C  -3.592252 -1.31482 -0.658116
C  -2.901248 0.957377 -0.07613
C  0.969625 3.336025 1.706548
C  1.835344 4.734542 -0.105142
C  -3.82352 -0.905088 -1.988992
C  -3.147072 1.372882 -1.405778
C  -0.764302 -1.956117 1.935054
C  1.51943 4.562588 1.261684
C  -3.607264 0.442332 -2.365439
H  -0.337163 1.175286 -1.691016
H  1.202861 1.556573 -2.564945
H  2.675671 -2.632529 -1.665161
H  3.906399 -1.721713 -0.791707
H  -2.412983 -0.025145 2.331509
H  -3.886191 -1.065855 2.237619
H  1.615334 -2.599282 2.892206
H  1.456387 -4.363661 2.59938
H  1.484415 -1.281274 0.654573
H  0.313822 1.334662 1.142197
H  1.865048 3.81183 -2.078959
H  -3.759292 -2.357702 -0.365364
H  -2.528961 1.680138 0.659992
H  -0.777214 -4.014514 1.862233
H  0.736668 3.194056 2.768019
H  2.272353 5.67673 -0.454394
H  -4.176327 -1.630571 -2.730423
H  -2.977352 2.417782 -1.689299
H  1.707502 5.372706 1.975403
H  -3.794531 0.762101 -3.396591
