program: Gaussian 09
title: 000297702
version: EM64L-G09RevD.01
frameworkgroup: C1[X(C14H24O2)]
method: RPBEPBE
basis: SDD
operation: Freq
keyword: #pfreq=noraman
keyword: PBEPBE/SDD
title: #p freq=noraman PBEPBE/SDD
converged: YES YES NO NO
title: Mulliken charges:
elementType: O O C C C C C C C C C C C C C C H H H H H H H H H H H H H H H H H H H H H H H H
charge: -0.200949 -0.200032 -0.324704 0.130879 0.136588 -0.392587 -0.018665 -0.529104 -0.358634 -0.349866 -0.356135 -0.354432 -0.223915 -0.696362 -0.689380 -0.675802 0.235664 0.209256 0.191283 0.222909 0.221892 0.246923 0.177514 0.191943 0.225516 0.199147 0.185384 0.208889 0.189276 0.218623 0.220787 0.208444 0.217938 0.214007 0.215665 0.212391 0.205711 0.236050 0.234305 0.213580
chargesum: 0.00000
title: Mulliken charges with hydrogens summed into heavy atoms:
elementType: O O C C C C C C C C C C C C C C
charge: -0.200949 -0.200032 -0.089041 0.130879 0.136588 0.007953 -0.018665 -0.084302 0.065803 0.067593 0.028396 0.043733 0.215495 -0.055973 -0.055614 0.008133
polarizability: 1.72624744e+02 1.86677391e+00 1.78269784e+02 2.90223880e+00 1.35874764e+01 1.30523201e+02
1716.lowfreq: -11.9911 -9.6995 -2.0247 0.0007 0.0008 0.0012 16.9783 24.3838 45.6112
frequency: 16.1349 24.3332 45.5878 48.9053 62.1068 62.7453 71.1992 81.6018 102.1952 113.9568 129.2461 153.6631 184.9646 204.9337 225.1508 236.2633 241.6012 250.6954 262.7914 284.2441 326.4536 369.4348 376.8789 414.0552 486.0053 547.5151 597.6629 649.3147 689.8167 729.1956 737.9151 745.3651 779.4457 803.2366 810.2515 822.2191 852.8323 879.6444 894.6999 917.1252 938.1968 971.0468 1003.0950 1015.8284 1024.7429 1051.8019 1068.8751 1072.7717 1084.8242 1103.6423 1110.2532 1116.7256 1131.1006 1137.3873 1155.2031 1189.9873 1206.7900 1227.0405 1230.6125 1247.1919 1253.9840 1272.3784 1283.0896 1289.9719 1293.4522 1302.9146 1311.6367 1326.3363 1332.3718 1352.1954 1354.1230 1373.4864 1388.1728 1389.4495 1402.1336 1454.5965 1461.1023 1462.6800 1465.2574 1467.8200 1473.6783 1474.1683 1476.8083 1476.8685 1479.3252 1485.7663 1486.8803 1489.0575 1614.6232 1718.0047 2949.9048 2958.4124 2963.3662 2966.2766 2968.5399 2971.2016 2973.1456 2979.6785 2980.1356 2990.0564 2999.5506 3003.1713 3007.4920 3009.2159 3026.6864 3044.2265 3045.3335 3055.9130 3067.6877 3069.7092 3071.0533 3072.8133 3096.5053 3110.5825
redmass: 3.5524 3.9304 2.9892 2.4458 1.7259 2.1755 2.4409 2.7033 3.0853 2.8551 2.8417 3.0456 3.5495 2.6205 1.1804 1.2426 1.2903 2.0495 2.2239 3.9432 3.4618 3.6886 4.1014 3.2822 2.7491 4.5724 5.1238 2.9675 3.2240 1.3093 2.1027 1.2967 2.4388 1.6199 1.1151 2.1721 1.9865 2.0642 1.7691 1.5663 1.4592 2.0123 2.2376 2.9633 2.9500 2.1522 2.2158 2.4190 1.5148 2.0291 2.1464 2.3072 1.5261 2.5861 1.6600 2.0017 1.4813 1.4087 1.7046 1.3263 1.1688 1.2446 1.1788 1.0828 1.4510 1.3518 1.5210 1.5797 1.6193 1.5858 1.5334 1.8085 1.2150 1.2147 1.2631 1.0975 1.0403 1.0803 1.0710 1.0654 1.0675 1.0673 1.0427 1.0428 1.0692 1.0769 1.0698 1.0846 9.8841 11.8162 1.0600 1.0598 1.0584 1.0648 1.0599 1.0382 1.0361 1.0705 1.0738 1.0558 1.0376 1.0938 1.0984 1.0998 1.1008 1.1027 1.1021 1.1080 1.1002 1.1003 1.1000 1.0998 1.0987 1.1021
irintensity: 0.5866 0.6596 1.3975 0.2394 0.0825 1.2063 0.0952 0.5529 0.8357 2.7314 2.7394 1.4524 1.0420 1.3424 0.1142 0.2738 0.7959 0.5615 0.5816 0.1624 5.3894 2.1430 5.8928 1.0481 2.3149 1.7513 2.5400 1.7629 7.9925 19.6949 7.0102 11.6279 7.4701 5.0615 5.1897 2.4227 7.0588 15.2846 2.3009 10.7865 9.8694 12.6728 3.8193 20.2677 34.4987 5.7025 13.8034 1.4533 7.6673 11.0808 4.0807 0.7983 24.4036 64.6948 6.9119 1.2244 2.2718 4.9741 56.8454 5.4860 0.5637 4.1689 44.6094 10.2151 62.4720 4.6287 57.7396 139.7398 45.3901 2.1562 8.6930 57.6667 8.9952 12.5364 20.8339 6.6205 13.1849 1.8840 8.5763 0.2598 4.3700 9.3647 14.2843 9.1886 2.9053 16.3414 10.1841 17.6925 379.9397 32.6635 20.5068 12.7500 12.1825 63.8175 46.1666 25.6847 40.4670 50.7714 35.8600 29.9206 18.5054 34.5092 5.9693 11.3613 16.2197 39.4462 29.1130 17.8217 75.8010 76.9032 59.8700 56.4611 26.2500 33.8963
temp: 298.150 k
press: 1.00000 atm
elementType: 8 8 6 6 6 6 6 6 6 6 6 6 6 6 6 6 1 1 1 1 1 1 1 1 1 1 1 1 1 1 1 1 1 1 1 1 1 1 1 1
symmnumber: 1
zpe: 915810.1 jmol-1
zpe.correction: 0.348814 hartree
zpe.thermalcorrener: 0.368896 hartree
zpe.thermalcorrenthalpy: 0.369840 hartree
zpe.thermalcorrgfe: 0.296923 hartree
zpe.sumelectzpe: -697.008976 hartree
zpe.sumelectthermal: -696.988894 hartree
zpe.sumelectthermalent: -696.987949 hartree
zpe.sumelectthermalfe: -697.060867 hartree
dipole: 0.6887 4.6837 2.2574
dipole: 5.2447
quadrupole: -96.8632 -94.4374 -103.3548
quadrupole: 4.5553 1.6271 -3.6079
quadrupole: 1.3553 3.7811 -5.1364 4.5553 1.6271 -3.6079
hfenergy: -697.3577894 hartree
pointgroup: C01 [X(C14H24O2)]
dipole: 0.4881284 1.7962869 0.8904268 debye
polarizability: 173.2895579|2.7673967|177.5809375|3.099911|13.5536441|130.5472342 unknown
InChI: InChI=1S/C14H24O2/c1-4-7-9-11-13(15)12(10-8-5-2)14(11)16-6-3/h11H,4-10H2,1-3H3
charge 0 multiplicity 1
40 atoms
O  -0.627523 2.429266 0.151734
O  -0.034965 -1.758873 -1.793926
C  0.914334 0.458143 -0.793769
C  -1.283718 0.244543 -0.853987
C  -0.384594 1.210787 -0.414726
C  1.881322 -0.005479 0.314897
C  -0.155713 -0.617709 -1.283232
C  -2.776591 0.104627 -0.904921
C  2.97534 -0.950368 -0.237739
C  -3.285513 -1.205277 -0.237894
C  3.931994 -1.469807 0.85923
C  -3.046295 -1.25379 1.287559
C  0.55093 3.257144 0.55221
C  5.035854 -2.392405 0.298695
C  -3.559579 -2.562517 1.926124
C  0.032233 4.663512 0.829355
H  1.478652 0.90967 -1.635002
H  1.30509 -0.526983 1.106553
H  2.366868 0.869285 0.797576
H  -3.1037 0.10909 -1.964808
H  -3.248907 0.981171 -0.420466
H  2.489002 -1.804214 -0.747599
H  3.563752 -0.41588 -1.012992
H  -4.370993 -1.306876 -0.439954
H  -2.787375 -2.069914 -0.718521
H  3.344455 -2.01721 1.624171
H  4.397974 -0.608144 1.381361
H  -1.962302 -1.142122 1.490538
H  -3.544975 -0.384482 1.764024
H  1.292426 3.243703 -0.26831
H  0.999522 2.801518 1.455042
H  5.65832 -1.85883 -0.4444
H  4.595099 -3.272699 -0.20548
H  5.704144 -2.759114 1.099444
H  -3.050721 -3.440619 1.485991
H  -3.381813 -2.579312 3.017338
H  -4.646492 -2.686563 1.75844
H  -0.729151 4.647353 1.627464
H  -0.421539 5.100687 -0.076033
H  0.864248 5.314292 1.15441
