program: Gaussian 09
title: 000297697
version: EM64L-G09RevD.01
frameworkgroup: C1[X(C10H10Cl2O2)]
method: RPBEPBE
basis: SDD
operation: Freq
keyword: #p
keyword: freq=noraman
keyword: PBEPBE/SDD
title: #p freq=noraman PBEPBE/SDD
converged: YES YES NO NO
title: Mulliken charges:
elementType: Cl Cl O O C C C C C C C C C C H H H H H H H H H H
charge: -0.058889 -0.019681 -0.251686 -0.209974 -0.591748 0.649714 -0.490225 -0.428468 -0.334425 0.348897 -0.216945 -0.234283 -0.233325 -0.492835 0.330869 0.329929 0.236907 0.234520 0.232535 0.231465 0.234364 0.247424 0.236358 0.249504
chargesum: 0.00000
title: Mulliken charges with hydrogens summed into heavy atoms:
elementType: Cl Cl O O C C C C C C C C C C
charge: -0.058889 -0.019681 -0.251686 -0.209974 -0.260879 0.649714 -0.160297 -0.191561 -0.099906 0.348897 0.015590 -0.002818 0.001039 0.240451
polarizability: 1.70281692e+02 1.70249659e+01 1.06650130e+02 1.72866417e+00 4.33530192e+00 1.18443202e+02
1716.lowfreq: -9.6671 0.0014 0.0021 0.0025 5.1299 10.3007 31.0423 41.4524 60.3984
frequency: 30.8773 41.3685 60.3960 69.3647 91.7085 110.6570 135.9371 155.1160 180.7452 206.6662 247.8315 271.4037 293.9286 325.4838 401.0239 470.9806 503.9816 555.9937 607.8945 619.3344 641.6347 680.4049 697.9287 739.8759 777.8541 801.0721 832.8992 847.6885 926.2443 976.7967 984.6861 990.7562 999.2212 1026.1020 1066.7218 1099.3860 1114.7875 1152.1359 1167.1201 1175.3562 1185.3087 1191.3286 1205.1422 1224.8961 1255.7962 1319.4843 1364.5073 1390.9913 1425.0769 1445.6952 1454.5903 1461.6805 1485.7371 1594.4688 1613.0319 1647.1977 3008.7738 3113.1745 3113.8634 3125.9227 3127.4852 3133.1795 3140.1242 3152.8331 3156.5589 3168.4735
redmass: 4.4858 6.5746 4.9895 6.3891 3.1672 1.3623 6.7378 7.8624 5.3162 6.8668 6.7058 5.1371 6.9328 8.0683 2.7715 4.7718 4.0393 7.4042 6.9186 7.1109 5.3714 5.2198 1.6172 6.8206 2.3146 3.8074 4.7568 1.2612 1.4539 1.4030 7.8620 6.0820 1.3348 2.2893 2.4179 2.1444 1.2667 1.4203 1.1055 1.0624 1.3390 1.1153 3.0234 1.8167 1.7012 1.3897 1.6487 4.9013 1.1858 2.1476 1.0490 1.0508 2.3402 6.0179 6.0818 9.6234 1.0294 1.1050 1.0878 1.0861 1.0881 1.0872 1.0917 1.0963 1.1050 1.1016
irintensity: 0.2714 0.4695 3.2624 0.3110 0.2885 0.3568 3.2904 3.3855 1.7072 3.0676 4.4256 8.7023 6.7039 7.5056 0.3422 6.0457 17.0413 38.8601 76.0719 34.0386 16.7386 12.8458 65.8291 0.8542 16.4529 18.8354 11.3852 0.1347 0.9023 0.5876 61.4548 2.1726 0.2255 1.4723 24.0277 4.5174 0.0027 19.0243 9.9165 0.1120 9.4702 3.2663 151.3677 20.0323 86.5386 4.9517 2.9069 0.9383 17.9010 13.0127 15.3077 9.9741 2.4256 0.6202 2.0550 192.4248 28.4625 19.0968 0.1507 4.3966 1.6783 0.9201 10.8091 30.7998 12.5224 19.6861
temp: 298.150 k
press: 1.00000 atm
elementType: 17 17 8 8 6 6 6 6 6 6 6 6 6 6 1 1 1 1 1 1 1 1 1 1
symmnumber: 1
zpe: 464059.5 jmol-1
zpe.correction: 0.176751 hartree
zpe.thermalcorrener: 0.191146 hartree
zpe.thermalcorrenthalpy: 0.192091 hartree
zpe.thermalcorrgfe: 0.133037 hartree
zpe.sumelectzpe: -1456.596969 hartree
zpe.sumelectthermal: -1456.582574 hartree
zpe.sumelectthermalent: -1456.581630 hartree
zpe.sumelectthermalfe: -1456.640683 hartree
dipole: 1.2430 0.0300 2.1210
dipole: 2.4585
quadrupole: -78.4130 -104.8743 -90.3361
quadrupole: 3.0768 -9.7043 -0.3315
quadrupole: 12.7948 -13.6665 0.8717 3.0768 -9.7043 -0.3315
hfenergy: -1456.7737203 hartree
pointgroup: C01 [X(C10H10Cl2O2)]
dipole: -0.5146131 0.5955988 0.5621543 debye
dipolederiv: -0.5251466 -0.0375517 0.0657768 -0.1447017 -0.3770825 0.2741508 0.3644985 0.290536 -0.5131713 -0.2939277 -0.0098027 0.0184378 0.0141691 -0.3189678 0.2277419 0.0353608 0.2557051 -0.4243173 -0.925691 -0.3020994 -0.1456652 -0.431137 -0.8239532 -0.3391284 -0.2846589 -0.3989418 -0.5101025 -0.7487979 0.2343312 0.2332356 -0.0370183 -0.6037339 -0.2270016 0.0236556 -0.2862841 -0.481148 0.8326223 0.0798239 -0.0996812 0.1602721 0.3219948 -0.2982156 -0.3493944 -0.2802823 0.543916 -0.228207 -0.0294026 0.0146228 0.0586429 -0.0460004 0.0309169 -0.070184 0.034387 -0.0736569 0.0059876 -0.0606955 0.0440911 -0.0920949 0.3131177 -0.3045441 0.0979231 -0.3029392 0.4839729 -0.0257236 0.0874907 0.05467 -0.055428 -0.0348733 0.1108143 -0.0213909 0.0829561 -0.0396294 -0.0187005 -0.0443516 -0.0764275 0.0547821 -0.0359562 0.034491 -0.0520508 0.0663147 -0.0503981 1.1725469 0.0228021 -0.2013996 0.3960413 1.0666853 0.5641345 0.1187988 0.691765 0.6170067 -0.0489412 -0.0828153 -0.1026011 -0.0869503 -0.0611596 0.0877747 -0.119687 0.0864135 -0.0128566 -0.0893832 0.0776344 0.0802488 0.1061784 -0.0061335 0.111826 0.0954519 0.1224413 -0.036573 0.1039344 0.0347181 -0.0176042 0.0251257 -0.0819853 0.0634262 -0.026522 0.0558072 -0.0844991 0.5998577 0.1991717 0.1100214 0.1714994 0.3275523 0.0274627 0.083842 0.0188507 0.2637098 0.0962924 0.0037443 0.0226269 -0.0356263 0.0138449 0.0143928 0.0016189 -0.0198928 -0.0302767 0.0649187 -0.035495 -0.0095249 -0.0336356 0.0211834 0.0223699 -0.0170345 -0.0144984 -0.0249697 0.0502821 -0.0815284 -0.0600005 -0.0664278 0.0341304 -0.0869811 -0.039553 -0.0884789 0.0579692 0.0345959 0.0612009 0.0846333 0.0508554 0.0587097 -0.064064 0.0962226 -0.0727381 0.0571889 0.0058897 0.0512107 0.0750885 0.0621956 0.0643079 -0.1019006 0.0877993 -0.1019946 0.0423595 0.035975 -0.0610895 -0.0391373 -0.0791451 0.0272979 -0.1099468 -0.0509103 -0.1148531 0.0499853 -0.1202497 -0.0363373 0.0145358 -0.0414125 0.1177698 -0.0295322 0.0178615 -0.0307986 0.1243652 -0.0478467 -0.00778 -0.0588646 0.0883017 -0.0339588 0.0730661 -0.0325434 0.0448271 0.0762039 0.0708098 -0.0028051 0.0086311 -0.0538854 -0.0207969 -0.1043206 -0.0285045 -0.1107178 0.0344667 -0.0010974 -0.060374 -0.015714 -0.0306007 0.078007 0.0230675 0.0694006 0.072416 -0.0695454 unknown
polarizability: 170.7425522|11.0333639|108.952475|-12.106514|6.3258948|115.6799968 unknown
InChI: InChI=1S/C10H10Cl2O2/c1-14-10(13)9(12)8(11)7-5-3-2-4-6-7/h2-6,8-9H,1H3
charge 0 multiplicity 1
24 atoms
Cl 0.685292 1.323456 -1.759032
Cl 0.790509 -1.613657 1.667293
O  2.937674 0.638838 0.722015
O  3.425016 -1.122121 -0.728208
C  0.20017 0.489638 -0.065979
C  -1.282625 0.239741 -0.037431
C  1.106077 -0.742493 -0.002191
C  -2.090624 1.0009 0.84365
C  -1.893715 -0.733175 -0.870711
C  2.60487 -0.451503 -0.067521
C  -3.485283 0.787321 0.903104
C  -3.285903 -0.944795 -0.814287
C  -4.08612 -0.186564 0.074174
C  4.375347 1.004328 0.737705
H  0.520782 1.235153 0.675029
H  0.862824 -1.497114 -0.762102
H  -1.624557 1.755117 1.488819
H  -1.287134 -1.311867 -1.576732
H  -4.099305 1.377438 1.591835
H  -3.750437 -1.695674 -1.462565
H  -5.168147 -0.352971 0.116341
H  4.976728 0.155456 1.103122
H  4.438774 1.862341 1.420483
H  4.703387 1.276907 -0.279114
