program: Gaussian 09
title: 000297689
version: EM64L-G09RevD.01
frameworkgroup: C1[X(C10H6Cl2O3)]
method: RPBEPBE
basis: SDD
operation: Freq
keyword: #p
keyword: freq=noraman
keyword: PBEPBE/SDD
title: #p freq=noraman PBEPBE/SDD
converged: NO NO NO NO
title: Mulliken charges:
elementType: Cl Cl O O O C C C C C C C C C C H H H H H H
charge: 0.006247 -0.043731 -0.239811 -0.282099 -0.174778 0.198391 0.194802 0.472366 -0.292086 -0.320821 -0.437018 -0.131415 -0.194697 0.171193 -0.506166 0.297827 0.275051 0.265764 0.242219 0.249473 0.249287
chargesum: 0.00000
title: Mulliken charges with hydrogens summed into heavy atoms:
elementType: Cl Cl O O O C C C C C C C C C C
charge: 0.006247 -0.043731 -0.239811 -0.282099 -0.174778 0.198391 0.194802 0.472366 0.005741 -0.045770 -0.437018 -0.131415 0.071067 0.171193 0.234813
polarizability: 2.30082516e+02 -8.01336244e+00 1.51637973e+02 -3.22930177e-02 -6.53765608e-03 5.51297354e+01
1716.lowfreq: -28.3256 -11.5078 -7.8673 -3.6812 -0.0021 -0.0014 -0.0013 58.2430 75.3176
frequency: -28.3013 58.2389 75.3167 135.7846 152.5539 163.4957 213.9470 235.4849 248.0894 280.2172 283.1793 318.3982 341.5704 344.1565 405.3170 440.2455 474.6242 527.6114 535.6975 581.3032 633.9426 634.2972 682.7019 687.3183 728.9369 811.6083 823.5166 871.6744 887.1543 902.9858 920.5096 954.9100 1069.9015 1102.9178 1105.0158 1118.4549 1142.2914 1172.5645 1221.0779 1252.1065 1304.3537 1397.9316 1401.3525 1441.5416 1460.4044 1462.1630 1463.7533 1544.8022 1588.9580 1608.0670 1679.4738 3015.3679 3134.3499 3141.5036 3168.8707 3187.2689 3196.1862
redmass: 3.8966 12.1839 6.2885 10.1115 8.1812 5.2392 1.1077 12.5062 4.6184 12.6598 10.1397 12.8252 6.9712 5.9980 7.0509 3.7198 8.6025 4.2621 9.7538 7.9503 7.9841 7.3365 9.4281 9.2712 5.1388 8.3834 1.4259 8.3866 10.5594 1.4019 8.0940 1.3388 1.8962 2.7664 1.2440 4.6875 1.5117 2.1947 4.0926 1.3864 3.8875 3.2855 11.2515 1.3406 1.1179 2.6670 1.0520 7.4469 9.0396 7.9804 12.8959 1.0282 1.1063 1.1056 1.0891 1.0978 1.0928
irintensity: 4.4566 0.4517 4.8101 0.2926 0.0215 2.0319 0.2805 0.2761 7.3466 0.7197 1.5114 0.0968 1.0449 1.3972 0.9455 2.1957 9.7737 14.2936 9.2743 7.9391 12.3860 1.2742 11.7613 48.2297 6.8930 30.0227 52.2287 10.1989 168.4846 14.5861 58.1730 1.2053 3.7218 93.3371 0.0378 10.9473 7.6961 56.1835 21.8753 33.3074 105.5298 42.8092 2.2412 46.6057 12.0250 73.2284 17.4296 186.6704 66.2470 13.4206 498.6015 38.0888 18.5590 12.2282 0.2007 0.3954 2.7281
temp: 298.150 k
press: 1.00000 atm
elementType: 17 17 8 8 8 6 6 6 6 6 6 6 6 6 6 1 1 1 1 1 1
symmnumber: 1
zpe: 357297.4 jmol-1
zpe.correction: 0.136087 hartree
zpe.thermalcorrener: 0.148667 hartree
zpe.thermalcorrenthalpy: 0.149611 hartree
zpe.thermalcorrgfe: 0.096477 hartree
zpe.sumelectzpe: -1529.369789 hartree
zpe.sumelectthermal: -1529.357209 hartree
zpe.sumelectthermalent: -1529.356265 hartree
zpe.sumelectthermalfe: -1529.409399 hartree
dipole: -1.7953 4.0412 0.0199
dipole: 4.4221
quadrupole: -110.7023 -93.5862 -100.2491
quadrupole: 21.9525 0.0370 0.0211
quadrupole: -9.1898 7.9264 1.2634 21.9525 0.0370 0.0211
hfenergy: -1529.5058762 hartree
pointgroup: C01 [X(C10H6Cl2O3)]
dipole: -0.8177902 -1.5335778 0.0785229 debye
dipolederiv: -0.6080182 0.1677772 -0.0717497 0.3481712 -0.1907253 0.0507074 -0.0911245 0.0346109 -0.0173994 -0.7783581 -0.2085712 -0.0407054 -0.3359867 -0.215759 -0.0128929 -0.0272371 -0.0017235 -0.0614618 -1.4186622 -0.1786564 -0.0901545 0.20208 -0.4340307 0.0438198 -0.1278441 0.0095453 -0.2033204 -0.3714357 0.0435254 -0.0111391 0.1349071 -1.6350371 0.147563 -0.0195048 0.143306 -0.3095165 -1.1881742 -0.4343031 -0.0299815 -0.5737368 -0.7526618 -0.0044157 -0.0226518 0.003827 -0.3189776 -0.2108457 0.132269 -0.0298326 0.0215308 -0.2307066 0.0227458 -0.0190457 0.0322189 -0.0280405 0.7066102 0.2558827 0.0250411 0.2592683 0.2053187 0.013233 0.024203 0.0125665 0.1149634 0.5751944 0.4121784 -0.0102062 0.0842313 1.4194303 -0.1152076 0.0225817 -0.0890354 0.2176105 -0.1221802 -0.1676425 0.0129389 0.0002203 -0.0582032 -0.0010386 -0.0035684 -0.015996 -0.0689518 -0.1064303 -0.0820832 0.0122501 -0.0332015 0.0809427 -0.0268041 0.0075369 -0.0305726 -0.1457308 0.3862499 -0.6335594 0.1179364 -0.8880794 -0.5160064 -0.0454344 0.1459588 -0.0207719 -0.1616783 1.0458299 0.4411216 0.0517258 0.7107918 0.1649086 0.0360539 0.023332 0.0124867 -0.0811419 -0.2791012 -0.0581179 -0.0103107 -0.2369801 0.0359265 -0.0337424 0.0083398 -0.0181585 -0.0886466 1.7993693 0.5135173 0.0770855 0.517822 1.2808475 -0.0566979 0.0813541 -0.0536832 0.3180246 0.3018771 -0.3445678 0.0360459 -0.1590112 0.7574168 -0.0611967 0.0164683 -0.0772369 0.2920663 0.1444154 -0.0110627 -0.0005126 -0.0308335 0.0435809 0.0096014 0.0015086 0.0113707 0.1618554 0.0834652 -0.0346528 -0.0045237 -0.0066428 -0.003191 0.0180328 -0.0074188 0.0155927 0.1744755 0.0041455 0.0635453 -0.0205344 0.04679 0.075679 0.0132574 -0.018653 0.0146265 0.1613379 0.0328403 -0.1209759 0.0042906 -0.0382956 -0.0877835 0.0185744 -0.0040557 0.0111124 0.1259666 0.0141351 0.1148766 -0.0849576 -0.0142791 0.0250533 -0.0605458 -0.0663675 -0.0001524 -0.0471704 -0.0109266 0.1294995 0.0672939 -0.0087661 0.0350004 0.0443872 0.0761882 0.0060668 -0.0342642 unknown
polarizability: 229.4989473|3.7068772|149.9278438|14.9587095|-9.4650192|57.4234331 unknown
InChI: InChI=1S/C10H6Cl2O3/c1-14-9-6-4-5(11)2-3-7(6)15-10(13)8(9)12/h2-4H,1H3
charge 0 multiplicity 1
21 atoms
Cl 3.475877 -0.97256 0.577936
Cl -4.635884 -0.783312 -0.156775
O  0.694709 1.966517 0.020153
O  0.403323 -2.232108 0.430424
O  2.98197 1.964111 0.227203
C  -0.591703 -0.126744 0.125257
C  -0.522214 1.284343 -0.014627
C  0.65294 -0.885664 0.313167
C  -1.8637 -0.760466 0.080262
C  -1.684856 2.06384 -0.196463
C  1.855049 -0.18724 0.347559
C  -3.006543 0.025836 -0.100255
C  -2.940695 1.43262 -0.240373
C  1.95364 1.270375 0.201574
C  1.423982 -3.286866 0.623077
H  -1.925118 -1.844855 0.186879
H  -1.587528 3.147627 -0.299942
H  -3.853057 2.01841 -0.380303
H  0.827845 -4.210138 0.666157
H  1.971964 -3.136307 1.565724
H  2.1225 -3.317522 -0.227234
