program: Gaussian 09
title: 000297690
version: EM64L-G09RevD.01
frameworkgroup: C1[X(C12H10Cl2O3)]
method: RPBEPBE
basis: SDD
operation: Freq
keyword: #p
keyword: freq=noraman
keyword: PBEPBE/SDD
title: #p freq=noraman PBEPBE/SDD
converged: NO YES NO NO
title: Mulliken charges:
elementType: Cl Cl O O O C C C C C C C C C C C C H H H H H H H H H H
charge: -0.046066 -0.003361 -0.241393 -0.286044 -0.183003 0.109178 0.480748 0.185182 0.610796 -0.583924 -0.603180 0.457418 -0.776433 -0.458787 -0.800325 0.162602 -0.509072 0.281300 0.245071 0.242903 0.245118 0.250767 0.231651 0.250742 0.236427 0.250879 0.250807
chargesum: 0.00000
title: Mulliken charges with hydrogens summed into heavy atoms:
elementType: Cl Cl O O O C C C C C C C C C C C C
charge: -0.046066 -0.003361 -0.241393 -0.286044 -0.183003 0.109178 0.480748 0.185182 0.610796 -0.583924 -0.321880 0.457418 -0.043341 -0.458787 -0.067165 0.162602 0.229042
polarizability: 2.62223085e+02 5.79175590e+00 1.82221006e+02 1.09164688e-02 1.19814114e-03 7.35024721e+01
1716.lowfreq: -54.0744 -8.9404 -4.3990 -1.8173 -0.0024 -0.0022 -0.0014 27.7989 54.5959
frequency: -54.0702 27.7955 54.5895 83.1887 113.8433 153.7739 156.5898 207.8080 218.5010 232.5103 243.0411 247.6298 254.9789 264.9718 283.4504 302.4778 314.5226 332.1734 370.1852 378.0718 450.6722 481.3679 528.5187 532.9195 552.2417 586.9096 595.6436 620.5050 657.0970 689.8610 711.2614 743.0513 819.9683 866.7818 880.4500 907.5613 976.1836 1003.7407 1037.7150 1037.9822 1048.6105 1053.8595 1103.7289 1109.9168 1131.7003 1173.7893 1197.0662 1287.8473 1311.6164 1361.1818 1372.8919 1402.4564 1407.8360 1424.8899 1446.7008 1459.6820 1462.1543 1464.9433 1466.7817 1471.8925 1473.1703 1525.4861 1569.9528 1608.6484 1677.4057 2990.7344 3013.5117 3013.9794 3070.6757 3093.0950 3103.6277 3131.5047 3132.9445 3135.3956 3172.5792
redmass: 3.6811 4.2961 9.4925 4.8635 6.1711 7.3976 1.0570 3.5244 1.2216 1.7750 1.6515 7.7264 6.8928 4.4647 8.4983 6.0634 10.4219 4.5885 7.9182 3.6657 6.1566 7.1599 7.1691 3.7677 5.6916 5.9672 6.1454 5.3450 8.1397 9.0170 9.7302 5.1162 6.0587 10.4905 1.3959 7.6890 3.1361 2.8628 1.6753 1.5169 1.5455 2.8935 1.2405 7.6914 2.0266 2.0930 2.2707 4.3922 7.8526 6.1792 3.9470 1.2201 1.2490 2.2068 1.9237 1.0448 1.0745 1.0524 1.1535 1.0466 1.1449 5.2295 7.8430 7.5175 12.8183 1.0370 1.0291 1.0368 1.0969 1.0968 1.1002 1.0986 1.1056 1.1063 1.0930
irintensity: 4.4312 0.9156 0.0612 6.2952 0.1036 0.6201 0.9466 1.2163 0.3548 0.0996 0.3723 0.8979 5.9350 0.7505 0.8519 2.0472 0.1519 3.4442 2.1244 1.8116 5.5913 0.6707 1.6611 0.0767 0.2186 0.4178 34.4053 5.9036 0.6047 17.4703 24.2826 1.4559 22.2886 29.6768 23.2656 183.8099 23.0574 21.7677 9.4503 7.1805 8.8580 28.3463 0.0327 85.0514 4.3347 39.8771 47.7360 66.1954 44.9675 27.6915 25.9337 21.0917 19.4934 8.7717 19.0433 16.5524 20.8885 16.8933 0.9134 10.2047 53.1374 149.3976 111.3474 102.2223 526.0325 14.6994 52.6919 1.4086 9.8155 10.5794 15.7122 9.0110 15.4268 16.8767 0.4871
temp: 298.150 k
press: 1.00000 atm
elementType: 17 17 8 8 8 6 6 6 6 6 6 6 6 6 6 6 6 1 1 1 1 1 1 1 1 1 1
symmnumber: 1
zpe: 501192.2 jmol-1
zpe.correction: 0.190894 hartree
zpe.thermalcorrener: 0.206707 hartree
zpe.thermalcorrenthalpy: 0.207651 hartree
zpe.thermalcorrgfe: 0.147283 hartree
zpe.sumelectzpe: -1607.820661 hartree
zpe.sumelectthermal: -1607.804848 hartree
zpe.sumelectthermalent: -1607.803903 hartree
zpe.sumelectthermalfe: -1607.864272 hartree
dipole: 2.4113 4.6276 0.0003
dipole: 5.2182
quadrupole: -118.7395 -109.9096 -112.5075
quadrupole: -25.5629 0.0047 0.0012
quadrupole: -5.0206 3.8092 1.2114 -25.5629 0.0047 0.0012
hfenergy: -1608.0115546 hartree
pointgroup: C01 [X(C12H10Cl2O3)]
dipole: -1.0096516 -1.7867274 0.0546907 debye
polarizability: 260.7016383|3.3107697|181.8502645|-18.4693009|2.4262927|75.3946609 unknown
InChI: InChI=1S/C12H10Cl2O3/c1-5-4-7-8(6(2)9(5)13)11(16-3)10(14)12(15)17-7/h4H,1-3H3
charge 0 multiplicity 1
27 atoms
Cl -4.235412 -1.135569 0.20959
Cl 3.967356 -0.494025 -0.586623
O  0.819191 2.044369 -0.207308
O  1.152689 -2.155613 -0.347092
O  3.083126 2.360619 -0.424993
C  -0.20765 -0.213019 -0.164128
C  -1.432652 -0.977981 -0.062094
C  -0.297137 1.209566 -0.118634
C  -2.724017 1.179286 0.120104
C  -2.633906 -0.24133 0.074939
C  -1.518394 1.892369 0.019475
C  1.150672 -0.781934 -0.31316
C  -1.47521 -2.496026 -0.095039
C  2.248031 0.075801 -0.40107
C  -4.039901 1.909677 0.268517
C  2.159205 1.532492 -0.354396
C  2.321414 -3.051427 -0.487463
H  -1.502893 2.984998 0.045957
H  -0.876797 -2.92663 0.724495
H  -2.508666 -2.857402 -0.003206
H  -1.047606 -2.884691 -1.033748
H  -4.554061 1.619156 1.202578
H  -3.882637 3.000179 0.279382
H  -4.729025 1.661767 -0.559037
H  1.868657 -4.054476 -0.464529
H  3.021718 -2.926058 0.352222
H  2.837604 -2.884198 -1.445037
