program: Gaussian 09
title: 000297732
version: EM64L-G09RevD.01
frameworkgroup: C1[X(C19H29NO2S)]
method: RPBEPBE
basis: SDD
operation: Freq
keyword: #p
keyword: freq=noraman
keyword: PBEPBE/SDD
title: #p freq=noraman PBEPBE/SDD
converged: NO YES NO NO
title: Mulliken charges:
elementType: S O O N C C C C C C C C C C C C C C C C C C C H H H H H H H H H H H H H H H H H H H H H H H H H H H H H
charge: 0.929342 -0.537295 -0.540885 -0.533582 0.046973 0.042935 -0.532871 -0.472658 -0.478264 -0.072097 -0.420115 -0.431740 -0.460936 -0.455021 -0.406052 -0.404715 -0.383306 0.005801 -0.242972 -0.269601 -0.204830 -0.204047 -0.218121 0.209407 0.205217 0.195562 0.197086 0.206378 0.198609 0.202014 0.212386 0.237427 0.224346 0.194517 0.179402 0.252447 0.190718 0.202499 0.197096 0.189047 0.196567 0.190678 0.192060 0.196049 0.198897 0.187362 0.298182 0.279454 0.291605 0.240817 0.240986 0.237240
chargesum: 0.00000
title: Mulliken charges with hydrogens summed into heavy atoms:
elementType: S O O N C C C C C C C C C C C C C C C C C C C
charge: 0.929342 -0.537295 -0.540885 -0.235399 0.256380 0.248152 -0.140223 -0.067672 -0.063864 0.165330 -0.001251 0.000110 -0.067719 -0.068879 -0.018806 -0.016606 0.002954 0.005801 0.036482 0.022004 0.035987 0.036939 0.019119
polarizability: 3.02883440e+02 1.80624561e+01 2.18929630e+02 -1.33175894e+01 1.13904799e+01 1.97320182e+02
1716.lowfreq: -33.2147 -21.7680 -19.5754 -0.0013 0.0004 0.0011 6.6772 8.6985 17.8438
frequency: -27.3605 -18.7536 16.3963 26.3244 36.8637 52.6161 68.8333 101.7027 126.8337 142.4313 154.1906 167.8474 199.6838 211.0428 214.8725 220.1194 245.9557 263.9037 267.3202 286.6892 314.3620 341.7273 370.8720 393.2525 403.3516 407.8529 419.1080 429.4222 434.0469 443.1041 461.2053 478.5444 495.3546 516.3642 548.1781 598.7977 602.1426 656.2201 691.1480 755.7205 761.1367 775.1972 782.2548 785.8694 795.7914 804.6627 830.2475 840.9522 849.6213 874.3247 886.9249 898.5081 906.2708 921.4015 932.6519 933.9039 945.3608 953.4173 967.4742 978.7082 983.2714 1004.6375 1009.5057 1021.4878 1040.0774 1047.3034 1049.6220 1052.1320 1053.8725 1061.2480 1075.9633 1079.4772 1092.2449 1103.1419 1110.4383 1115.2092 1129.3093 1160.0846 1171.8560 1172.7612 1176.9975 1198.5448 1213.8906 1230.2672 1245.3819 1253.9021 1258.4359 1260.8651 1275.3869 1287.9598 1293.0631 1296.5233 1301.6493 1307.4989 1315.7539 1325.3167 1327.4532 1332.2162 1337.8641 1338.5925 1340.8755 1341.2867 1351.9502 1359.3400 1360.2305 1376.9061 1383.8815 1435.5766 1449.9763 1452.5975 1457.1087 1459.9007 1460.4988 1461.7553 1463.2661 1467.0960 1468.8883 1473.0966 1476.5275 1578.4501 1604.3979 2934.0037 2938.8069 2942.5513 2947.5611 2951.8062 2954.9173 2957.0555 2961.6998 2962.8119 2963.1766 2964.5153 2972.3404 2992.4653 2993.3540 3013.4335 3020.2854 3023.7529 3025.2636 3025.5333 3035.3355 3038.3406 3051.8346 3057.1947 3136.4324 3147.3739 3156.9443 3165.8107 3174.8457 3334.7750
redmass: 3.9431 3.5720 4.6037 3.8116 3.5826 3.7833 4.3861 4.2084 5.0533 3.7128 4.0447 5.7690 4.4381 2.5177 2.1030 2.1676 8.4313 4.3619 2.6479 3.1599 1.7398 5.9979 6.7966 2.0483 2.8315 2.9578 2.6644 2.7692 3.2035 2.9297 2.2989 4.1654 3.1535 3.8103 1.9034 2.0824 6.4672 6.4194 2.2862 2.7050 1.4881 2.1006 1.6969 1.4863 13.9359 1.8451 1.5613 2.3745 1.2466 1.9612 1.6459 1.4230 1.6232 2.2975 3.9599 1.3819 1.9746 2.4950 2.0606 5.0394 1.4567 1.3356 3.9484 3.8341 1.8487 2.1705 1.5275 1.3179 1.9733 1.1137 1.5765 1.8025 2.1132 2.2189 2.5466 2.4712 1.8780 2.1797 1.5408 1.0620 1.1245 1.4544 1.3424 1.3385 1.2771 1.2172 1.2535 1.2639 1.2529 1.2913 1.3609 1.2525 1.3058 1.2750 1.2539 1.3768 1.3638 1.3781 1.4952 1.4828 1.4418 1.5225 1.4620 1.3820 1.5116 1.2877 8.3984 2.2376 1.0896 2.0300 1.0879 1.0879 1.0900 1.0903 1.0861 1.0811 1.0832 1.0949 1.0954 5.8201 6.9155 1.0597 1.0778 1.0776 1.0630 1.0675 1.0643 1.0661 1.0628 1.0596 1.0675 1.0657 1.0666 1.0856 1.0944 1.0965 1.0989 1.0978 1.0944 1.1011 1.0974 1.1034 1.0965 1.0992 1.0858 1.0887 1.0928 1.0968 1.1014 1.0740
irintensity: 0.5468 0.2203 1.0868 0.0366 0.3859 0.1365 1.0224 0.9258 1.4628 0.6573 0.1583 1.0798 5.4722 0.1690 1.4320 1.0684 10.5995 5.5418 1.2584 3.0623 0.3672 0.8584 9.4610 4.0510 0.8995 16.0527 8.9336 1.5743 60.1756 16.4984 8.5280 9.4795 19.4305 74.0257 1.4014 6.3288 0.0056 5.1502 35.4777 6.7212 79.3116 13.1350 10.4656 1.6201 65.4964 67.4651 46.6698 3.2940 1.1084 16.4863 11.3161 21.1292 2.5439 25.6940 32.7762 2.0149 21.4825 9.3893 5.5806 1.2638 0.0871 0.1246 1.1027 9.2097 0.9480 29.5145 1.7109 2.1688 7.5177 0.6097 4.1060 1.5948 2.9274 11.0412 2.3130 2.7827 6.3282 5.3057 1.7230 0.2509 5.7268 3.7337 2.1004 3.2842 1.6598 2.0277 2.8043 2.6058 4.3584 6.3977 12.1339 0.1187 3.6764 0.4270 1.4161 1.4727 4.2563 0.2032 3.9455 0.1754 1.1081 1.3522 1.6249 0.1309 0.5894 6.3800 5.2798 15.6784 0.5134 15.4950 1.6470 9.0990 3.9971 7.5576 13.1380 20.6877 16.0707 0.8796 2.4420 3.8048 0.3444 16.9845 7.3762 0.9568 20.7114 23.9312 3.7984 74.5128 29.8306 39.3483 33.1949 40.2685 17.5014 29.9792 11.4697 92.3439 62.2847 66.5006 65.0190 21.6347 68.4502 138.9888 14.9388 40.6493 0.9528 11.6073 2.0394 5.1509 26.7842 14.8998
temp: 298.150 k
press: 1.00000 atm
elementType: 16 8 8 7 6 6 6 6 6 6 6 6 6 6 6 6 6 6 6 6 6 6 6 1 1 1 1 1 1 1 1 1 1 1 1 1 1 1 1 1 1 1 1 1 1 1 1 1 1 1 1 1
symmnumber: 1
zpe: 1167364.6 jmol-1
zpe.correction: 0.444626 hartree
zpe.thermalcorrener: 0.466219 hartree
zpe.thermalcorrenthalpy: 0.467163 hartree
zpe.thermalcorrgfe: 0.392971 hartree
zpe.sumelectzpe: -1342.737210 hartree
zpe.sumelectthermal: -1342.715617 hartree
zpe.sumelectthermalent: -1342.714673 hartree
zpe.sumelectthermalfe: -1342.788865 hartree
dipole: 0.7664 -4.5617 2.2088
dipole: 5.1259
quadrupole: -135.5026 -153.7938 -149.3515
quadrupole: 23.9906 -5.9764 7.7594
quadrupole: 10.7134 -7.5778 -3.1355 23.9906 -5.9764 7.7594
hfenergy: -1343.1818359 hartree
pointgroup: C01 [X(C19H29N1O2S1)]
dipole: -0.331447 1.9181299 0.5272342 debye
polarizability: 302.2728716|21.6201025|214.8139402|9.5033434|-14.4629848|202.0464407 unknown
InChI: InChI=1S/C19H29NO2S/c21-23(22,19-9-5-2-6-10-19)20-18-13-11-17(12-14-18)15-16-7-3-1-4-8-16/h2,5-6,9-10,16-18,20H,1,3-4,7-8,11-15H2
charge 0 multiplicity 1
52 atoms
S  3.282856 -1.429612 -0.145258
O  2.582164 -1.577915 -1.616837
O  4.005935 -2.685696 0.60111
N  2.083248 -0.764871 1.134132
C  -2.125779 0.412599 0.705784
C  -4.577754 0.289551 -0.264125
C  -3.388696 1.163931 0.209876
C  -1.059927 1.426642 1.19781
C  -1.513284 -0.507405 -0.380605
C  0.828399 -0.167422 0.583721
C  0.235831 0.740088 1.691244
C  -0.215464 -1.201559 0.097115
C  -5.132736 -0.628585 0.856628
C  -5.715819 1.183622 -0.825252
C  -6.347563 -1.461331 0.379679
C  -6.927559 0.354363 -1.311796
C  -7.469036 -0.558243 -0.186058
C  4.512349 -0.004617 -0.287755
C  5.465397 0.15244 0.731541
C  4.442632 0.806294 -1.430855
C  6.397858 1.20629 0.59632
C  5.383374 1.856832 -1.546058
C  6.352235 2.056408 -0.5351
H  -2.405773 -0.223102 1.573882
H  -4.23208 -0.361784 -1.096971
H  -3.088698 1.833367 -0.625735
H  -3.747042 1.829284 1.025361
H  -1.480223 2.048472 2.012816
H  -0.812261 2.119351 0.365326
H  -1.295364 0.099111 -1.285411
H  -2.241951 -1.280324 -0.6894
H  1.124354 0.472357 -0.27226
H  0.991217 1.488006 1.992858
H  0.01211 0.121105 2.584535
H  -0.453898 -1.884747 0.941201
H  0.220183 -1.80929 -0.716581
H  -5.438126 0.005801 1.716767
H  -4.340915 -1.308444 1.227762
H  -5.325541 1.809237 -1.653243
H  -6.04855 1.882151 -0.027442
H  -6.735259 -2.078439 1.213831
H  -6.016628 -2.165672 -0.412032
H  -6.617567 -0.275257 -2.172032
H  -7.727181 1.026803 -1.679465
H  -8.307149 -1.177247 -0.561492
H  -7.8760 0.073325 0.631235
H  1.89863 -1.596995 1.732168
H  5.487006 -0.531005 1.586031
H  3.695981 0.601824 -2.205202
H  7.15745 1.359751 1.369878
H  5.361471 2.509371 -2.425095
H  7.07934 2.869887 -0.63265
