program: Gaussian 09
title: 000297778
version: EM64L-G09RevD.01
frameworkgroup: C1[X(C23H27ClO4)]
method: RPBEPBE
basis: SDD
operation: Freq
keyword: #p
keyword: freq=noraman
keyword: PBEPBE/SDD
title: #p freq=noraman PBEPBE/SDD
converged: YES YES NO NO
title: Mulliken charges:
elementType: Cl O O O O C C C C C C C C C C C C C C C C C C C C C C C H H H H H H H H H H H H H H H H H H H H H H H H H H H
charge: -0.079463 -0.252530 -0.399179 -0.167345 -0.207310 -0.271829 0.118175 0.329420 -0.533360 -0.289595 -0.585860 0.151097 0.065500 0.223352 0.322981 -0.563214 -0.546428 -0.730679 -0.715865 0.010006 0.665115 -0.733262 -0.742086 -0.379173 -0.337676 -0.254151 -0.259875 -0.240003 0.295206 0.218960 0.228398 0.310041 0.249870 0.229801 0.239411 0.233124 0.242171 0.238373 0.217933 0.223400 0.213290 0.252866 0.210203 0.207270 0.353902 0.220268 0.228976 0.208530 0.213547 0.223051 0.214037 0.224937 0.250308 0.225069 0.230295
chargesum: 0.00000
title: Mulliken charges with hydrogens summed into heavy atoms:
elementType: Cl O O O O C C C C C C C C C C C C C C C C C C C C C C C
charge: -0.079463 -0.252530 -0.045277 -0.167345 -0.207310 0.023377 0.118175 0.329420 -0.086002 0.020446 -0.106189 0.151097 0.065500 0.223352 0.322981 -0.090679 -0.065884 -0.076056 -0.045525 0.010006 0.665115 -0.075488 -0.091450 -0.379173 -0.112739 -0.003844 -0.034806 -0.009708
polarizability: 2.76792959e+02 -1.05911957e+01 2.81546317e+02 -1.10973418e+01 -3.28264178e+00 2.22277338e+02
1716.lowfreq: -5.2919 -1.6505 0.0005 0.0007 0.0010 6.6209 34.0854 39.4861 44.9686
frequency: 34.0012 39.4794 44.9531 52.2482 61.0710 71.4639 87.5511 101.9678 122.0043 133.1905 144.9451 163.5627 180.0573 191.3267 193.2601 202.5083 218.4509 228.8459 233.4884 247.5966 268.6507 278.6377 292.1494 305.4761 313.8404 314.4571 342.5509 355.8641 361.6041 367.7007 370.8906 383.7938 397.3969 409.5521 419.0568 440.7973 458.8852 463.5720 473.6220 498.9500 526.7008 536.5827 542.4119 558.7650 583.2357 595.1244 617.1602 632.0518 652.3778 686.4098 697.2722 722.1195 729.7878 754.2853 772.8462 779.3928 816.8246 839.4031 855.4278 878.8554 883.3082 884.4974 906.8772 924.0250 928.1752 932.5752 935.8038 939.8883 941.5974 948.1960 964.2352 972.6878 981.2991 997.3983 1009.7757 1011.7885 1015.6396 1029.4908 1038.9173 1061.7014 1082.7701 1111.9263 1116.2208 1125.2962 1136.5502 1150.0638 1157.0393 1165.8859 1171.0610 1176.6601 1192.2659 1205.9318 1211.2857 1221.5652 1248.2058 1257.8469 1258.3002 1272.3362 1280.2897 1282.2814 1289.1166 1294.9269 1299.7583 1307.1238 1327.0743 1331.5069 1363.6552 1365.5194 1377.9525 1379.9363 1381.3261 1396.0680 1402.1617 1426.9826 1433.3056 1440.1659 1444.6120 1444.8066 1458.8151 1461.7988 1463.9027 1468.7414 1470.2430 1479.6688 1480.9795 1484.3670 1485.8320 1570.4936 1575.4790 1606.8628 1637.1252 1643.1351 2960.1339 2963.9093 2967.6356 2968.9060 2973.2343 2978.0265 2979.3375 2984.8806 2994.3062 3007.2857 3029.9089 3040.3312 3051.9174 3061.8348 3064.8322 3068.4958 3070.1215 3072.1207 3072.6330 3077.5993 3079.9252 3100.6116 3130.1761 3145.4549 3158.2470 3172.4785 3534.1676
redmass: 4.4984 8.2293 4.7960 4.7702 4.8742 3.7364 6.0636 4.6797 3.6455 8.3612 4.5155 3.0819 5.2765 1.4440 1.1071 2.2111 2.1934 1.7973 1.4375 3.3759 1.8981 1.8992 3.7129 4.4701 2.9305 2.8258 2.7889 3.2763 2.4752 3.0216 2.4807 1.8013 6.3020 2.2970 2.7199 3.1300 3.9752 3.6772 3.5251 3.4163 4.1301 4.7150 4.1539 5.2832 4.5916 4.1473 5.5603 5.3575 5.4412 4.6875 4.8792 4.3879 4.2904 1.3556 3.3923 3.5172 3.7919 4.8016 1.5250 2.5091 1.8130 1.7740 2.5879 2.3536 2.1493 1.8545 1.4583 1.5079 2.0135 1.5213 2.5159 2.2909 1.3405 2.3504 1.6952 3.5193 1.7205 2.2031 2.1026 2.6631 1.7387 2.1026 2.6114 1.5985 1.7937 1.5104 1.6814 1.4492 1.3928 2.1452 1.7882 2.5790 2.0528 1.9777 1.7297 1.8006 2.3963 1.7464 1.9040 1.4171 1.7216 1.8614 1.7140 1.8508 1.8924 1.8122 2.2917 2.6785 1.2068 1.3190 3.1983 1.2079 1.2100 2.2287 1.0970 1.0871 1.0852 1.0835 2.5594 1.0490 1.0493 1.0609 1.0622 1.0569 1.0584 1.0589 1.0601 10.5824 6.4941 7.2527 9.6019 9.2870 1.0632 1.0631 1.0370 1.0363 1.0625 1.0369 1.0558 1.0411 1.0807 1.0814 1.0947 1.1014 1.0948 1.0994 1.0996 1.0995 1.0998 1.0988 1.0988 1.0977 1.0984 1.0978 1.0851 1.0898 1.0951 1.0996 1.0653
irintensity: 0.0704 0.2657 1.2106 1.2554 1.0683 1.0588 1.4694 0.5792 1.7522 0.7407 0.3916 0.9793 2.7408 0.0666 0.9234 1.4794 1.4026 1.7868 0.6391 0.3747 1.2449 1.0210 0.4480 0.0484 0.1672 7.2190 3.0268 2.6031 27.9018 7.2770 5.1594 68.6764 19.7930 17.5286 16.9427 4.9669 3.6748 6.2245 22.0559 3.5789 2.9286 13.9622 16.8812 6.4572 2.7262 5.2010 20.6476 5.9808 13.1729 10.6803 22.7307 0.0280 6.1162 86.7931 4.1243 0.7735 31.1444 15.5515 3.7368 6.0087 5.1993 3.0436 29.4116 18.0169 6.0950 1.5264 0.9949 3.0018 19.2352 6.1748 58.0894 2.2535 0.7278 54.4521 15.2834 29.4338 6.8858 77.7013 11.4088 117.6085 9.5212 11.8966 64.6448 11.5413 15.1599 3.6040 11.3146 8.6408 5.6561 10.0944 24.2517 54.9533 13.1040 12.0602 11.0137 40.0511 17.2730 5.0835 15.2199 6.7544 35.3292 9.7098 20.5366 61.9834 29.8101 53.0607 56.5667 25.8593 20.3110 5.0000 47.3974 13.3802 19.0141 25.6935 5.4210 8.6146 9.1230 5.5511 33.3724 1.0925 1.7933 10.9717 13.2958 6.3673 6.2474 18.7196 12.0088 173.7877 36.9572 1.8540 43.7695 195.2886 18.8702 14.2068 45.5073 28.6336 15.8187 20.2638 28.7888 23.5630 2.9184 10.5745 10.1214 10.3764 9.6164 24.2862 23.7411 17.0505 7.7337 10.4742 55.0952 63.6173 50.1868 30.7098 1.4860 14.4638 18.0439 17.0187 9.2711
temp: 298.150 k
press: 1.00000 atm
elementType: 17 8 8 8 8 6 6 6 6 6 6 6 6 6 6 6 6 6 6 6 6 6 6 6 6 6 6 6 1 1 1 1 1 1 1 1 1 1 1 1 1 1 1 1 1 1 1 1 1 1 1 1 1 1 1
symmnumber: 1
zpe: 1171623.0 jmol-1
zpe.correction: 0.446248 hartree
zpe.thermalcorrener: 0.473286 hartree
zpe.thermalcorrenthalpy: 0.474230 hartree
zpe.thermalcorrgfe: 0.390681 hartree
zpe.sumelectzpe: -1651.531739 hartree
zpe.sumelectthermal: -1651.504701 hartree
zpe.sumelectthermalent: -1651.503757 hartree
zpe.sumelectthermalfe: -1651.587306 hartree
dipole: 3.5777 -3.4769 6.0939
dipole: 7.8756
quadrupole: -161.5723 -161.6601 -179.1736
quadrupole: 4.2897 -4.5119 3.7635
quadrupole: 5.8964 5.8086 -11.7049 4.2897 -4.5119 3.7635
hfenergy: -1651.9779869 hartree
pointgroup: C01 [X(C23H27Cl1O4)]
dipole: 1.6602277 -0.9008791 2.4561549 debye
polarizability: 281.0370294|-11.3621795|276.2831963|-9.7075659|-8.9420545|223.2963886 unknown
InChI: InChI=1S/C23H27ClO4/c1-21(2)9-15(25)19-17(11-21)28-23(27)12-22(3,4)10-16(26)20(23)18(19)13-7-5-6-8-14(13)24/h5-8,18,20,27H,9-12H2,1-4H3
charge 0 multiplicity 1
55 atoms
Cl -0.559558 3.598894 -1.773124
O  1.259307 -1.188883 0.97056
O  0.654013 0.787746 2.15548
O  1.696294 0.268706 -2.453509
O  -2.622269 -0.650075 -1.863987
C  1.033446 1.016346 -0.207027
C  1.489039 0.289431 1.079735
C  3.993217 0.252248 0.247381
C  2.981172 0.459488 1.415665
C  -0.430987 0.686745 -0.612636
C  3.492404 1.058306 -0.998371
C  2.045324 0.72934 -1.3385
C  -0.71328 -0.794446 -0.426115
C  0.113175 -1.625584 0.29081
C  -1.516926 -3.590778 0.159498
C  -0.053541 -3.121252 0.408582
C  -2.029577 -2.902253 -1.13547
C  5.369111 0.812229 0.69125
C  4.156991 -1.243992 -0.128315
C  -1.849802 -1.380969 -1.169346
C  -1.450155 1.625393 0.041653
C  -2.420138 -3.214944 1.363821
C  -1.532205 -5.127906 -0.024769
C  -1.605951 2.961223 -0.39606
C  -2.29161 1.21572 1.105593
C  -2.535767 3.85811 0.160962
C  -3.235926 2.085406 1.686659
C  -3.362423 3.41203 1.215609
H  1.12247 2.097294 0.019201
H  3.229744 -0.230778 2.246848
H  3.090184 1.493353 1.799557
H  -0.489617 0.868145 -1.704779
H  4.126721 0.846496 -1.876117
H  3.560574 2.142778 -0.772215
H  0.619931 -3.609053 -0.327711
H  0.294602 -3.441736 1.409071
H  -3.098387 -3.123262 -1.310041
H  -1.474529 -3.307119 -2.008863
H  5.74848 0.266838 1.575891
H  6.115401 0.701825 -0.11684
H  5.304961 1.885417 0.952228
H  3.217334 -1.687524 -0.495334
H  4.922212 -1.354548 -0.918895
H  4.483622 -1.830779 0.750104
H  0.941993 0.357025 3.002535
H  -3.462492 -3.533167 1.178705
H  -2.429735 -2.125553 1.546476
H  -2.070425 -3.71452 2.286767
H  -0.909898 -5.435646 -0.886319
H  -2.561228 -5.49131 -0.20297
H  -1.145406 -5.640647 0.876596
H  -2.185757 0.192082 1.47871
H  -2.616136 4.877691 -0.226878
H  -3.873403 1.730584 2.503716
H  -4.095895 4.095637 1.656326
