program: Gaussian 09
title: 000297672
version: EM64L-G09RevD.01
frameworkgroup: C1[X(C20H14)]
method: RPBEPBE
basis: SDD
operation: Freq
keyword: #p
keyword: freq=noraman
keyword: PBEPBE/SDD
title: #p freq=noraman PBEPBE/SDD
converged: NO YES NO NO
title: Mulliken charges:
elementType: C C C C C C C C C C C C C C C C C C C C H H H H H H H H H H H H H H
charge: 0.081716 0.173278 0.429101 0.218217 0.419269 -0.482917 0.181929 -0.508562 -0.359530 -0.462791 -0.344627 -0.263629 -0.458654 -0.284401 -0.255239 -0.361715 -0.361775 -0.225671 -0.225725 -0.244975 0.235079 0.236731 0.251104 0.241473 0.260712 0.230903 0.238948 0.229104 0.228737 0.250311 0.250282 0.227886 0.227871 0.227561
chargesum: 0.00000
title: Mulliken charges with hydrogens summed into heavy atoms:
elementType: C C C C C C C C C C C C C C C C C C C C
charge: 0.081716 0.173278 0.429101 0.218217 0.419269 -0.247838 0.181929 -0.271831 -0.108426 -0.221319 -0.083914 -0.032726 -0.219706 -0.055296 -0.026503 -0.111404 -0.111493 0.002215 0.002146 -0.017414
polarizability: 2.64716410e+02 -4.16508952e+00 2.71371134e+02 -8.54267960e-02 -3.29895671e-02 1.20816029e+02
1716.lowfreq: -22.0965 -0.0004 0.0004 0.0004 8.6050 11.5391 13.1046 57.1464 64.7280
frequency: -21.8900 57.1204 64.7239 99.6946 119.7166 215.3942 219.5376 228.1598 240.9010 309.3708 327.6872 400.1618 406.2111 409.1595 450.0895 485.7557 499.6116 524.5069 534.2678 563.8883 574.1546 610.5852 612.7627 644.1636 663.0787 706.5391 713.0286 737.0338 756.0139 764.2325 773.4351 786.2726 816.2223 829.8722 854.6389 857.7879 887.5917 908.8672 917.7988 925.6433 960.7471 977.1951 978.7563 984.9158 986.9689 989.7559 994.8711 994.8839 1023.7491 1045.2368 1072.6855 1076.4644 1095.3447 1144.3699 1167.8838 1171.5096 1177.3249 1187.1832 1190.0973 1230.8004 1233.5798 1269.2277 1282.0434 1306.8446 1309.2930 1360.0140 1363.4397 1391.7816 1406.8828 1414.5598 1428.1253 1434.5895 1451.1627 1483.7793 1499.2248 1530.7552 1576.5942 1579.9500 1598.5277 1608.5829 1618.7672 1633.4936 3116.3932 3119.2239 3121.8011 3122.0361 3128.0333 3133.6215 3134.5757 3140.2091 3142.8939 3148.6187 3156.5567 3158.6721 3163.3277 3222.1927
redmass: 4.0757 4.1199 5.0801 4.1029 4.3849 4.7930 4.1033 3.9043 6.0615 4.2749 4.0751 2.8422 6.3460 3.1012 5.1201 3.4911 5.3907 3.2267 5.9972 3.7567 3.2921 5.7559 7.2669 3.7809 6.0843 1.6846 5.7552 2.7918 1.2894 5.5986 2.0158 1.3560 2.0563 5.5105 1.9172 1.2742 1.6959 3.5285 1.4174 1.6255 1.3781 1.3584 1.3850 7.4234 6.2390 1.3798 1.3460 1.3382 2.5436 2.3096 2.4444 1.6098 2.1749 1.5056 1.2485 1.0528 1.1238 1.1242 1.3447 2.2404 1.6691 1.8498 2.0382 2.4428 1.3947 5.3717 6.0230 6.8529 3.0330 1.9056 2.2303 2.4816 2.2762 2.5421 3.4956 4.5474 7.0363 5.9725 5.8215 6.1542 6.1424 6.9195 1.0862 1.0863 1.0846 1.0863 1.0877 1.0909 1.0914 1.0925 1.0988 1.0968 1.0992 1.0998 1.1017 1.0911
irintensity: 0.0104 0.0276 0.2669 0.7839 1.1716 0.6488 0.0810 3.4353 0.2855 0.1323 2.4169 0.0509 0.1750 3.7108 0.0045 0.8602 0.4383 4.4162 3.3915 11.5786 0.0015 0.6471 5.1531 0.0662 2.3533 48.9735 0.8175 39.6325 47.4742 0.4267 43.8671 0.2261 4.8092 0.9725 61.6538 2.3715 20.2720 3.2304 6.3796 3.0165 1.2923 1.9162 0.0205 2.5357 1.0629 0.6636 0.2020 0.1903 6.6937 4.5847 2.2374 8.3618 4.2833 4.8028 1.2367 0.0223 6.7244 0.6176 1.1432 0.0423 2.3709 6.0806 3.2127 11.9170 0.6830 0.8037 0.1077 0.0609 5.5238 0.0100 7.7404 17.3268 14.0198 10.8236 3.3386 1.7859 3.3362 1.3852 1.5982 7.4524 0.8370 0.5239 0.8689 3.0719 0.9875 2.3678 0.8418 13.7903 15.3524 16.5897 44.2735 33.6651 46.4021 26.0411 23.0651 5.3803
temp: 298.150 k
press: 1.00000 atm
elementType: 6 6 6 6 6 6 6 6 6 6 6 6 6 6 6 6 6 6 6 6 1 1 1 1 1 1 1 1 1 1 1 1 1 1
symmnumber: 1
zpe: 710197.8 jmol-1
zpe.correction: 0.270500 hartree
zpe.thermalcorrener: 0.284127 hartree
zpe.thermalcorrenthalpy: 0.285071 hartree
zpe.thermalcorrgfe: 0.230220 hartree
zpe.sumelectzpe: -769.223249 hartree
zpe.sumelectthermal: -769.209622 hartree
zpe.sumelectthermalent: -769.208678 hartree
zpe.sumelectthermalfe: -769.263529 hartree
dipole: 0.3283 -0.0432 0.0004
dipole: 0.3311
quadrupole: -100.4542 -104.4862 -117.0922
quadrupole: -3.6966 -0.0185 -0.0123
quadrupole: 6.8900 2.8580 -9.7480 -3.6966 -0.0185 -0.0123
hfenergy: -769.493749 hartree
pointgroup: C01 [X(C20H14)]
dipole: -0.1292118 0.0165785 0.0001302 debye
polarizability: 264.7438867|-4.1869715|271.3435681|0.1090743|0.0961835|120.8161181 unknown
InChI: InChI=1S/C20H14/c1-2-7-15(8-3-1)19-12-6-10-17-14-13-16-9-4-5-11-18(16)20(17)19/h1-14H
charge 0 multiplicity 1
34 atoms
C  0.724118 -0.727326 -0.000189
C  1.12664 0.696513 0.000003
C  1.779245 -1.725291 0.000084
C  -0.638397 -1.218885 -0.000837
C  2.536129 1.032454 0.001156
C  3.171274 -1.332944 0.001124
C  -1.891252 -0.379508 -0.000273
C  3.538869 -0.006696 0.001803
C  -0.887805 -2.609053 -0.001718
C  1.479188 -3.121346 -0.000668
C  0.207603 1.796078 -0.001164
C  0.156869 -3.567941 -0.001707
C  2.957361 2.398573 0.001463
C  0.6417 3.12982 -0.000932
C  2.028515 3.443855 0.00049
C  -2.519829 -0.022468 1.221798
C  -2.52337 -0.026136 -1.221568
C  -3.743549 0.685366 1.223336
C  -3.747085 0.681733 -1.221687
C  -4.36073 1.042073 0.001177
H  3.927708 -2.126594 0.001369
H  4.595117 0.287365 0.002679
H  -1.930468 -2.945908 -0.002194
H  2.310968 -3.835739 -0.000445
H  -0.864042 1.609733 -0.002328
H  -0.078589 -4.637475 -0.00235
H  4.033297 2.6116 0.002399
H  -0.101054 3.935397 -0.001879
H  2.360321 4.487978 0.000725
H  -2.042223 -0.297189 2.169065
H  -2.048481 -0.303665 -2.169385
H  -4.214942 0.954094 2.175627
H  -4.221206 0.947664 -2.173408
H  -5.309501 1.590571 0.001733
