program: Gaussian 09
title: 000297654
version: EM64L-G09RevD.01
frameworkgroup: C1[X(C18H13N)]
method: RPBEPBE
basis: SDD
operation: Freq
keyword: #pfreq=noraman
keyword: PBEPBE/SDD
title: #p freq=noraman PBEPBE/SDD
converged: YES YES NO NO
title: Mulliken charges:
elementType: N C C C C C C C C C C C C C C C C C C H H H H H H H H H H H H H
charge: -0.704956 0.080311 0.252203 0.196938 0.433555 0.419000 0.400600 -0.484236 -0.471382 -0.495489 -0.620961 -0.491041 -0.398979 -0.442293 0.515630 -0.446006 -0.460086 -0.266774 -0.255376 0.236585 0.237197 0.238424 0.260467 0.235868 0.269388 0.236059 0.238420 0.220162 0.224987 0.227712 0.307641 0.306430
chargesum: 0.00000
title: Mulliken charges with hydrogens summed into heavy atoms:
elementType: N C C C C C C C C C C C C C C C C C C
charge: -0.090885 0.080311 0.252203 0.196938 0.433555 0.419000 0.400600 -0.247651 -0.234185 -0.257065 -0.360494 -0.255172 -0.129591 -0.206233 0.515630 -0.207586 -0.239924 -0.041787 -0.027664
polarizability: 3.24131306e+02 -1.92295268e-01 2.61764237e+02 -1.00972119e+01 -1.27885371e+00 8.49761450e+01
1716.lowfreq: -5.7347 -0.0005 -0.0003 0.0004 1.8661 7.4396 67.9370 79.0523 115.0938
frequency: 67.9362 79.0475 115.0931 134.9997 183.1139 235.0896 264.5421 273.0064 318.5884 351.9369 356.1855 387.2116 397.1764 416.0697 419.0083 450.7921 475.4211 478.2156 516.2258 524.7094 541.9504 579.6068 621.0540 624.8248 680.0983 684.0105 690.5993 722.0220 756.4765 758.7596 792.4858 794.7244 805.0226 814.6629 831.1108 856.6438 874.0556 888.0920 901.6121 946.4663 958.2894 963.4867 972.0951 983.0969 994.7480 999.6651 1037.3240 1066.0717 1102.8435 1139.9397 1162.1545 1166.7156 1174.7943 1215.2585 1224.8279 1230.3098 1247.0055 1258.3330 1289.1830 1323.3077 1346.4570 1393.0964 1404.1240 1406.7072 1415.8146 1426.5248 1447.3024 1454.1159 1503.2536 1513.7183 1537.5315 1562.3589 1604.7539 1612.2366 1627.9596 1638.1442 1644.2957 3115.9038 3117.3416 3118.8891 3119.4652 3130.8897 3140.2793 3142.5329 3145.2149 3153.5790 3157.8148 3178.1668 3566.7787 3707.5800
redmass: 4.6084 4.1740 4.7119 4.4221 4.0202 4.4914 4.4767 4.3692 3.7455 1.3314 3.4398 1.1261 4.0719 3.2835 4.9376 3.4023 3.8053 5.3482 3.8186 5.5863 3.4634 3.1415 6.8749 3.7799 5.7512 3.1200 5.5189 5.7948 1.3120 2.3131 3.8455 1.8585 2.2318 4.4830 1.8306 1.7146 1.9043 3.7659 1.5371 1.3310 2.3227 1.6711 1.5197 1.4283 1.4583 2.0801 1.9663 1.7702 2.5038 1.4409 1.2603 1.1962 1.1091 1.8822 1.5526 2.6647 1.9486 1.5615 1.8485 2.2838 3.2825 3.8841 4.5496 3.9704 2.3001 3.3666 2.7235 3.2343 3.8678 3.9980 4.0490 8.0487 6.9163 5.8898 4.9963 2.0895 2.0501 1.0864 1.0862 1.0862 1.0860 1.0898 1.0979 1.0988 1.0980 1.0936 1.0949 1.0938 1.0449 1.1039
irintensity: 0.4049 1.0779 0.4268 5.6074 1.8413 2.3335 0.5003 4.4133 1.2511 175.0638 35.3195 90.5194 1.4948 4.5994 1.5099 0.7564 0.7837 1.1952 1.5353 1.8819 20.5095 6.2710 10.8600 1.2412 0.1723 4.6058 1.2525 7.5983 32.1733 15.2583 3.7325 16.2646 10.7473 4.8724 9.1319 113.9978 4.6764 12.9464 24.1753 1.2303 4.1866 0.4828 0.0373 0.6909 1.0667 0.3069 9.2396 0.3171 0.8633 20.3872 7.6990 9.3236 0.3587 16.7313 4.1588 1.5527 24.3982 7.0736 29.8052 19.2012 20.3583 0.2722 9.5081 6.1050 5.3443 5.6864 13.8172 12.5865 21.6885 15.6107 61.6354 2.6395 42.2794 1.9803 17.2545 6.3642 392.9694 7.1862 4.2612 2.9133 1.7902 13.7206 29.4204 31.9273 57.2158 21.0953 21.8386 15.3328 91.1327 19.6385
temp: 298.150 k
press: 1.00000 atm
elementType: 7 6 6 6 6 6 6 6 6 6 6 6 6 6 6 6 6 6 6 1 1 1 1 1 1 1 1 1 1 1 1 1
symmnumber: 1
zpe: 666624.6 jmol-1
zpe.correction: 0.253904 hartree
zpe.thermalcorrener: 0.267753 hartree
zpe.thermalcorrenthalpy: 0.268697 hartree
zpe.thermalcorrgfe: 0.214116 hartree
zpe.sumelectzpe: -747.237580 hartree
zpe.sumelectthermal: -747.223731 hartree
zpe.sumelectthermalent: -747.222787 hartree
zpe.sumelectthermalfe: -747.277368 hartree
dipole: -1.6893 -2.0308 -0.5282
dipole: 2.6938
quadrupole: -88.2689 -89.0394 -118.1509
quadrupole: 7.3109 -0.4776 1.5999
quadrupole: 10.2175 9.4470 -19.6645 7.3109 -0.4776 1.5999
hfenergy: -747.4914837 hartree
pointgroup: C01 [X(C18H13N1)]
dipole: -0.63311 0.8241572 0.2078161 debye
polarizability: 323.9255446|-2.3532847|261.8609607|11.3709349|-0.9314063|85.0851825 unknown
InChI: InChI=1S/C18H13N/c19-15-10-9-13-6-8-14-7-5-12-3-1-2-4-16(12)18(14)17(13)11-15/h1-11H,19H2
charge 0 multiplicity 1
32 atoms
N  -3.243691 3.000769 0.549258
C  0.237487 -0.545248 -0.013976
C  -1.154105 -0.076128 -0.019917
C  1.413913 0.328268 -0.074525
C  0.46419 -1.963217 0.056022
C  -2.212334 -1.041337 -0.255825
C  2.722508 -0.220867 0.227785
C  -0.620874 -2.894827 -0.121257
C  1.787512 -2.48014 0.306098
C  -1.910936 -2.4439 -0.336405
C  -1.542841 1.266295 0.277419
C  2.87116 -1.63589 0.453558
C  1.377371 1.694207 -0.516458
C  -3.568311 -0.591349 -0.326383
C  -2.891043 1.68569 0.239758
C  3.875348 0.626147 0.230125
C  -3.912332 0.740478 -0.110716
C  2.52601 2.496119 -0.542913
C  3.784729 1.974631 -0.127083
H  -0.395447 -3.967202 -0.102988
H  1.908777 -3.565982 0.39749
H  -2.730153 -3.149616 -0.518298
H  -0.791766 1.98301 0.619159
H  3.866146 -2.03133 0.68908
H  0.445149 2.105212 -0.909754
H  -4.352875 -1.329331 -0.532673
H  4.845914 0.185844 0.489203
H  -4.95876 1.064271 -0.164985
H  2.457224 3.527319 -0.907472
H  4.675187 2.612512 -0.128554
H  -2.536343 3.684107 0.802882
H  -4.218217 3.284185 0.578847
