program: Gaussian 09
title: 000297663
version: EM64L-G09RevD.01
frameworkgroup: C1[X(C19H15N)]
method: RPBEPBE
basis: SDD
operation: Freq
keyword: #pfreq=noraman
keyword: PBEPBE/SDD
title: #p freq=noraman PBEPBE/SDD
converged: YES YES NO NO
title: Mulliken charges:
elementType: N C C C C C C C C C C C C C C C C C C C H H H H H H H H H H H H H H H
charge: -0.677122 0.116943 0.365779 -0.052629 0.339918 -0.019180 0.225730 0.158271 0.413072 -0.451924 -0.507899 -0.836254 -0.442089 -0.403461 -0.415312 -0.449023 -0.264994 -0.276519 -0.258570 -0.258448 0.250838 0.233129 0.232794 0.233017 0.234640 0.226465 0.214542 0.276192 0.240545 0.333601 0.307541 0.226241 0.228101 0.226634 0.229432
chargesum: 0.00000
title: Mulliken charges with hydrogens summed into heavy atoms:
elementType: N C C C C C C C C C C C C C C C C C C C
charge: -0.035980 0.116943 0.365779 -0.052629 0.339918 -0.019180 0.225730 0.158271 0.413072 -0.201086 -0.274771 -0.135803 -0.215624 -0.188919 -0.139120 -0.208478 -0.038753 -0.048418 -0.031936 -0.029016
polarizability: 4.04025951e+02 2.05577823e+00 2.42346566e+02 3.49754583e+00 1.54586262e+00 9.01599110e+01
1716.lowfreq: -11.2444 -0.9022 -0.0006 -0.0004 0.0002 1.4684 49.2401 64.6925 105.6064
frequency: 49.2183 64.6885 105.6020 119.9535 145.2804 177.1379 190.4317 225.3366 272.6766 301.1867 317.8570 341.0526 360.2423 377.7644 406.0893 432.9746 441.4244 445.4131 475.1722 511.7797 518.1509 520.4815 548.2625 553.7286 588.6600 599.8911 617.1114 651.1677 654.4575 697.1915 719.1133 758.7576 766.2840 770.5804 776.5361 812.5718 817.8925 837.2307 878.1313 879.4398 894.0127 927.5497 945.5574 964.9919 979.8367 983.4799 995.7050 1028.1745 1028.4528 1038.0564 1054.8598 1066.8701 1087.4775 1125.5763 1139.2970 1157.4782 1179.4515 1183.1527 1188.8269 1235.3238 1248.6017 1270.1142 1305.2688 1315.3382 1351.5501 1382.8134 1393.9720 1395.6390 1404.7810 1419.3282 1428.6423 1446.4346 1450.8192 1477.6923 1483.9146 1500.5928 1509.0809 1548.9256 1560.8184 1570.9442 1609.9339 1613.4034 1627.9645 1645.8062 2975.0096 3041.1516 3112.9983 3118.6372 3118.6896 3123.4419 3129.5158 3133.0403 3150.9742 3153.4203 3163.4052 3168.6765 3169.7485 3529.3548 3664.4198
redmass: 4.2430 3.6099 2.3059 3.9811 1.3858 3.7267 4.2591 3.9085 4.7601 5.2541 2.8036 3.3810 3.6173 3.6281 2.4001 1.7157 3.4143 3.9883 5.3356 1.6287 3.7611 4.7511 3.7854 2.9036 3.2635 4.1407 5.3618 5.0530 3.8133 3.4734 5.1248 1.4550 1.3070 3.8871 2.6636 4.3870 2.4227 1.5865 4.1664 2.6213 1.5008 3.4037 1.3855 1.3526 1.3426 1.3809 1.3267 3.0260 2.9016 1.5867 2.1061 1.7412 2.9100 2.3539 1.8552 1.7076 1.1197 1.1250 1.3390 2.0065 1.5555 1.6801 2.1417 3.1572 3.9817 4.0311 2.4275 6.1390 1.2206 2.9011 3.1774 4.0007 2.2814 1.5927 1.1242 2.0076 2.3823 5.5221 5.7305 7.4286 5.8653 5.9330 5.9394 1.1940 1.0419 1.0977 1.0924 1.0854 1.0867 1.0884 1.0890 1.0885 1.0935 1.0941 1.0996 1.0972 1.0943 1.0459 1.1015
irintensity: 0.0669 0.0868 0.0979 1.0878 3.3467 3.3547 0.6267 3.4726 0.6705 3.0407 3.8250 0.5184 1.1362 7.6160 13.8430 40.8644 1.4474 5.8663 7.6761 171.4248 2.8398 0.4443 30.1642 13.0764 0.7276 1.8312 1.9438 13.4190 8.0694 4.0391 6.8596 108.2046 15.2906 3.3636 3.6795 3.1950 7.0793 49.6948 2.3887 8.8232 9.6209 8.4735 0.8541 2.9239 0.0647 2.0672 3.2566 2.3684 19.8130 1.1376 4.1124 0.7768 1.3507 6.6616 4.4984 5.3696 0.4980 2.2942 2.1958 5.2844 0.8493 7.2465 0.3312 8.3236 0.9127 44.8356 48.4656 17.5928 3.4783 22.7871 23.1805 31.3913 8.4106 30.9206 12.0350 4.4027 18.2670 1.0356 27.6492 19.0161 2.6109 16.3897 8.7863 182.2077 51.7781 21.2569 18.0605 3.6633 1.5468 9.1637 15.3665 8.1431 18.6343 32.5882 40.7069 48.4743 19.0191 22.9275 21.8850
temp: 298.150 k
press: 1.00000 atm
elementType: 7 6 6 6 6 6 6 6 6 6 6 6 6 6 6 6 6 6 6 6 1 1 1 1 1 1 1 1 1 1 1 1 1 1 1
symmnumber: 1
zpe: 739566.8 jmol-1
zpe.correction: 0.281686 hartree
zpe.thermalcorrener: 0.297059 hartree
zpe.thermalcorrenthalpy: 0.298003 hartree
zpe.thermalcorrgfe: 0.239972 hartree
zpe.sumelectzpe: -786.454870 hartree
zpe.sumelectthermal: -786.439498 hartree
zpe.sumelectthermalent: -786.438554 hartree
zpe.sumelectthermalfe: -786.496584 hartree
dipole: 0.0353 -1.0073 0.8880
dipole: 1.3433
quadrupole: -103.1513 -97.3560 -123.6838
quadrupole: 0.1446 0.6977 -2.7358
quadrupole: 4.9124 10.7077 -15.6201 0.1446 0.6977 -2.7358
hfenergy: -786.7365563 hartree
pointgroup: C01 [X(C19H15N1)]
dipole: 0.0103988 0.3985192 -0.3469776 debye
polarizability: 404.0869101|0.5251366|242.2994847|-0.9573829|2.3844438|90.1460337 unknown
InChI: InChI=1S/C19H15N/c1-12-14-7-4-5-9-17(14)19(20)18-15(12)11-10-13-6-2-3-8-16(13)18/h2-11H,20H2,1H3
charge 0 multiplicity 1
35 atoms
N  -0.172967 2.452824 -0.61125
C  0.444322 0.119587 -0.055853
C  -0.028419 -1.26112 -0.034214
C  -1.412953 -1.59271 0.004433
C  -2.374895 -0.529769 0.054504
C  -0.530851 1.150008 -0.243937
C  -1.934886 0.850589 -0.081314
C  1.891171 0.381286 0.061369
C  2.821339 -0.716758 -0.066841
C  0.962684 -2.321971 -0.113417
C  2.312971 -2.065279 -0.185876
C  -1.837049 -3.055593 -0.015434
C  -3.790041 -0.762632 0.207117
C  -2.91431 1.901078 -0.041156
C  2.45095 1.660518 0.390783
C  4.226877 -0.485914 -0.003499
C  -4.716083 0.278655 0.226892
C  -4.274859 1.632956 0.107597
C  3.839652 1.863932 0.476673
C  4.743304 0.79424 0.242591
H  0.616843 -3.358525 -0.137234
H  3.032338 -2.887486 -0.281672
H  -2.9294 -3.17597 -0.028122
H  -1.45239 -3.574536 -0.913943
H  -1.458942 -3.606411 0.867211
H  -4.156104 -1.785737 0.326553
H  -2.596786 2.949829 -0.065772
H  1.791861 2.487187 0.670619
H  4.903489 -1.340579 -0.125091
H  0.77295 2.628304 -0.943261
H  -0.897798 3.069821 -0.969672
H  -5.782764 0.06165 0.351446
H  -4.998533 2.453611 0.156004
H  4.223035 2.854795 0.745489
H  5.824742 0.960618 0.290283
