program: Gaussian 09
title: 000297640
version: EM64L-G09RevD.01
frameworkgroup: C1[X(C17H18O2)]
method: RPBEPBE
basis: SDD
operation: Freq
keyword: #pfreq=noraman
keyword: PBEPBE/SDD
title: #p freq=noraman PBEPBE/SDD
converged: YES YES NO NO
title: Mulliken charges:
elementType: O O C C C C C C C C C C C C C C C C C H H H H H H H H H H H H H H H H H H
charge: -0.232890 -0.233099 0.491898 -0.599556 -0.570415 -0.410427 -0.452371 -0.452195 -0.217799 0.474202 0.175114 -0.504563 0.413038 -0.335432 -0.246198 -0.451158 -0.441709 -0.267802 -0.245255 0.229121 0.229148 0.239099 0.239203 0.223598 0.223757 0.238491 0.190144 0.190180 0.238434 0.202681 0.228094 0.287110 0.227334 0.237501 0.234202 0.223281 0.225242
chargesum: 0.00000
title: Mulliken charges with hydrogens summed into heavy atoms:
elementType: O O C C C C C C C C C C C C C C C C C
charge: -0.232890 -0.233099 0.491898 -0.141288 -0.092114 0.036929 -0.023736 -0.023582 -0.015118 0.474202 0.175114 -0.276469 0.413038 -0.048322 -0.018864 -0.213657 -0.207507 -0.044521 -0.020014
polarizability: 2.37217416e+02 1.16578589e+00 2.17970362e+02 4.01182434e-02 -1.38069532e-02 1.06226364e+02
1716.lowfreq: -64.3783 0.0005 0.0008 0.0009 3.2023 8.9799 14.8334 48.2678 48.6351
frequency: -64.3655 48.1100 48.3804 67.7863 128.0363 158.8466 179.6029 204.2734 209.1272 244.8175 266.7204 309.5814 382.4053 383.5141 404.6458 427.7594 452.7904 469.9911 476.5005 502.8921 529.1855 572.6629 579.1568 637.6959 651.8745 704.9977 738.4790 740.0299 742.8261 781.6180 787.2232 791.4262 809.6914 811.4265 843.2487 885.4264 887.5520 904.7751 914.0785 921.4288 937.3183 946.2785 951.7613 957.8066 963.3296 980.4205 984.0327 992.1612 1010.4349 1025.5908 1046.8446 1063.1496 1083.9171 1089.4216 1151.3584 1165.3937 1170.3455 1173.8158 1184.0501 1192.5278 1201.0265 1212.1568 1231.0356 1239.4010 1243.9202 1244.8276 1280.6438 1297.9325 1302.6515 1317.3391 1337.7162 1355.6952 1367.6938 1383.9294 1412.3713 1422.2452 1444.3646 1451.1418 1456.1995 1457.0519 1459.6633 1465.7639 1483.4228 1519.8626 1592.4852 1602.5559 1636.2588 2883.9629 2913.1367 2924.6736 2998.4576 3014.8133 3027.4385 3058.5346 3070.0469 3074.4496 3077.5199 3102.2337 3117.4347 3118.5948 3125.7608 3133.0052 3154.4265 3156.9768 3195.3456
redmass: 1.9111 4.5877 4.0566 3.8607 4.2837 3.8736 3.8988 4.1953 5.9767 2.6626 5.4533 3.5339 1.9445 2.1381 4.0821 3.1495 3.8685 4.0059 3.9700 6.6703 6.8535 3.3156 8.0426 6.1388 3.4990 4.5502 1.0998 3.8587 1.2677 1.3274 1.8066 5.4090 3.9646 1.6904 2.5777 4.5947 2.0699 5.6061 2.1327 1.4980 3.6927 2.7137 1.6364 2.9095 1.4119 2.7649 1.3715 1.3516 7.0985 2.6892 1.1331 2.5570 3.7611 2.7995 1.4083 1.8807 1.6541 1.1288 1.2660 1.1217 1.0947 1.3301 1.5325 1.3688 1.7170 1.5433 1.6313 1.7532 2.1308 1.2005 1.1821 1.3412 2.4470 1.6950 3.7828 3.6694 2.2503 1.0796 1.1247 1.0859 2.4886 1.0959 1.1103 4.0406 7.2593 5.4091 6.6326 1.0837 1.0683 1.0683 1.0586 1.0580 1.0639 1.1068 1.0948 1.0958 1.1065 1.1065 1.0870 1.0862 1.0908 1.0908 1.0983 1.0987 1.0940
irintensity: 0.0187 0.2576 0.0035 1.6748 2.1267 2.1300 1.6124 3.3764 1.4106 0.5353 2.7721 0.0699 0.5283 0.2145 2.6584 1.8933 1.6122 6.0370 5.6153 0.4062 3.0767 12.2905 1.3358 10.2661 2.8493 2.5310 6.1719 7.8008 0.8991 1.1358 44.8992 0.8498 1.8727 120.3395 53.9807 4.6512 0.9083 17.3201 27.3987 7.1447 9.7342 4.1121 0.6242 13.8035 3.9213 21.7764 2.3754 0.5463 193.5999 9.4050 0.5599 41.1494 0.5232 29.9605 6.4395 22.1537 0.5400 6.3441 2.7517 2.8303 0.0224 1.4841 0.8615 1.7234 14.3853 1.5453 0.4493 13.9291 0.0190 2.3522 1.3137 20.7631 35.0484 18.3719 7.3543 2.3984 1.7124 9.4953 21.7309 1.6080 9.0291 2.5007 2.1048 14.9766 1.9341 0.8011 0.0263 49.7499 21.5592 135.1865 52.3414 47.6792 40.8687 5.5408 25.2119 18.1721 0.0545 66.9333 5.2311 1.1907 15.6952 24.1929 45.9519 28.9356 5.9087
temp: 298.150 k
press: 1.00000 atm
elementType: 8 8 6 6 6 6 6 6 6 6 6 6 6 6 6 6 6 6 6 1 1 1 1 1 1 1 1 1 1 1 1 1 1 1 1 1 1
symmnumber: 1
zpe: 802913.8 jmol-1
zpe.correction: 0.305814 hartree
zpe.thermalcorrener: 0.320535 hartree
zpe.thermalcorrenthalpy: 0.321480 hartree
zpe.thermalcorrgfe: 0.263991 hartree
zpe.sumelectzpe: -807.644006 hartree
zpe.sumelectthermal: -807.629284 hartree
zpe.sumelectthermalent: -807.628340 hartree
zpe.sumelectthermalfe: -807.685829 hartree
dipole: 2.4440 -0.8798 0.0041
dipole: 2.5975
quadrupole: -92.7652 -100.7181 -119.2363
quadrupole: -1.1860 0.0099 -0.0105
quadrupole: 11.4746 3.5218 -14.9964 -1.1860 0.0099 -0.0105
hfenergy: -807.9498195 hartree
pointgroup: C01 [X(C17H18O2)]
dipole: 0.9591636 0.3526419 -0.0027708 debye
polarizability: 237.2276365|-1.0269434|217.9395831|-0.7883275|1.3358891|106.246922 unknown
InChI: InChI=1S/C17H18O2/c1-2-7-14-13(5-1)6-3-8-15(14)16-18-11-17(12-19-16)9-4-10-17/h1-3,5-8,16H,4,9-12H2
charge 0 multiplicity 1
37 atoms
O  1.065985 0.612247 1.211716
O  1.051503 0.635145 -1.209958
C  3.183352 0.182329 -0.015822
C  4.757132 0.224201 -0.025075
C  3.230505 -1.389578 -0.030852
C  4.799875 -1.346534 -0.041992
C  2.534006 0.797957 1.235154
C  2.519176 0.821211 -1.24728
C  0.49876 1.243303 0.010049
C  -1.004934 1.09967 0.017753
C  -1.657595 -0.189057 0.006615
C  -1.771036 2.270274 0.03626
C  -3.108742 -0.229513 0.015165
C  -0.940465 -1.432662 -0.01288
C  -3.198002 2.22597 0.044832
C  -3.853778 0.99551 0.034412
C  -3.778197 -1.498511 0.004063
C  -1.621509 -2.651476 -0.023376
C  -3.051625 -2.68946 -0.01488
H  5.204733 0.689164 0.87176
H  5.19393 0.708564 -0.916976
H  2.77068 -1.843573 -0.92515
H  2.78407 -1.859916 0.86178
H  5.264809 -1.778736 -0.943552
H  5.278396 -1.797984 0.842874
H  2.875595 0.308296 2.162074
H  2.76933 1.8867 1.28991
H  2.754186 1.910786 -1.284438
H  2.849662 0.348977 -2.187168
H  0.79654 2.320785 0.018454
H  -1.266478 3.244131 0.04459
H  0.150534 -1.406011 -0.01951
H  -3.76905 3.160278 0.059537
H  -4.949497 0.948292 0.04067
H  -4.874895 -1.515237 0.010643
H  -1.058094 -3.591336 -0.03836
H  -3.57056 -3.654503 -0.023444
