program: Gaussian 09
title: 000297635
version: EM64L-G09RevD.01
frameworkgroup: C1[X(C16H15Cl)]
method: RPBEPBE
basis: SDD
operation: Freq
keyword: #p
keyword: freq=noraman
keyword: PBEPBE/SDD
title: #p freq=noraman PBEPBE/SDD
converged: YES YES NO NO
title: Mulliken charges:
elementType: Cl C C C C C C C C C C C C C C C C H H H H H H H H H H H H H H H
charge: -0.059944 0.384158 -0.544619 0.331234 -0.444577 0.448002 -0.684644 -0.400763 -0.370441 -0.364633 -0.391116 -0.235648 -0.226333 -0.241292 -0.227287 -0.234474 -0.238838 0.249994 0.221066 0.238285 0.220761 0.212677 0.228538 0.255655 0.257912 0.245316 0.225342 0.226932 0.228991 0.228961 0.229454 0.231331
chargesum: 0.00000
title: Mulliken charges with hydrogens summed into heavy atoms:
elementType: Cl C C C C C C C C C C C C C C C C
charge: -0.059944 0.384158 -0.073560 0.331234 -0.444577 0.448002 -0.012922 -0.172225 -0.114786 -0.106720 -0.145799 -0.010306 0.000599 -0.012301 0.001674 -0.005021 -0.007507
polarizability: 2.83530271e+02 2.88340508e+00 1.49963100e+02 3.61583086e-01 -1.93167110e+00 1.30088001e+02
1716.lowfreq: -5.7378 -0.0013 -0.0008 0.0011 1.4311 9.4975 34.8496 43.3915 49.1603
frequency: 34.8065 43.3412 49.1545 69.3424 93.0791 104.4730 150.5395 181.9281 203.7313 224.4285 248.0184 275.8144 302.2704 340.3090 402.8818 403.5948 436.8378 456.4114 494.0199 545.9664 569.9345 612.7897 616.2900 652.7891 656.0382 698.9794 702.3369 747.7201 770.5063 774.9417 814.3646 843.3217 852.7251 853.7475 919.0615 927.8044 949.7613 976.2690 978.3341 988.2562 988.7270 994.5108 996.8803 1024.2471 1027.6321 1048.9078 1060.7470 1082.8817 1088.9842 1102.7956 1172.9635 1173.1935 1189.8293 1192.2581 1222.6705 1250.2185 1271.4612 1310.9082 1317.1118 1320.3586 1372.3000 1373.6370 1388.3522 1430.1899 1431.5168 1471.6580 1474.0128 1475.3624 1483.2167 1487.4015 1579.9026 1582.2938 1605.4262 1609.1515 1633.2024 2981.4371 2982.4711 3060.7485 3077.1082 3090.0685 3122.9989 3126.6494 3130.6205 3135.6337 3143.2698 3148.7546 3154.0118 3157.1411 3166.6277 3168.8035
redmass: 4.7976 4.3437 4.0532 4.7857 3.3435 3.8876 4.4129 4.7614 1.2987 4.2036 4.1003 4.0428 3.6779 3.2751 2.8510 2.8419 4.6825 4.0389 4.2481 4.0978 4.4046 6.2288 6.2870 4.7889 5.7772 1.8582 1.6594 2.1484 2.0316 1.6683 1.8317 3.7182 1.2750 1.3158 1.4576 1.4533 2.3623 1.3861 1.3829 5.9997 5.6806 1.3394 1.3277 2.6354 2.1687 2.6110 1.6633 1.6038 1.7309 1.7711 1.0523 1.0529 1.1120 1.1167 3.3018 1.6369 2.2813 1.3824 1.3678 1.3828 6.1070 6.9547 1.1997 2.2768 2.2718 1.2125 1.1340 1.5630 2.0824 1.1249 5.8515 5.8796 6.0590 6.0985 9.5799 1.0657 1.0357 1.0938 1.1002 1.0996 1.0845 1.0847 1.0876 1.0880 1.0927 1.0925 1.0961 1.0963 1.1013 1.1014
irintensity: 0.2219 0.2121 0.0971 0.6247 0.2250 0.3888 0.3337 0.5224 0.0466 1.3004 0.1306 0.6377 0.4050 5.3982 0.3086 0.2012 2.1226 3.4099 11.5590 5.8848 7.2196 0.4465 0.6808 5.1482 15.9357 35.6802 62.9287 46.6861 34.6075 47.6457 7.5878 36.4578 0.7565 1.8596 1.2080 1.4204 3.3679 0.1995 0.1204 0.3336 1.0508 0.0877 0.1177 1.2790 15.4322 4.4674 2.6041 11.5417 5.7851 10.0191 0.0226 0.0339 2.1366 0.6179 20.0495 1.7859 11.7787 1.9301 1.4169 2.6656 0.6015 0.8010 14.2579 7.1056 10.9612 3.3251 5.0891 5.9485 24.5678 10.2244 0.9720 1.9055 1.0262 5.8317 6.0816 20.1550 31.4284 5.2147 40.4151 45.0234 3.0848 1.2495 1.4325 4.3041 27.7727 21.4925 34.1809 26.3558 21.7887 18.1610
temp: 298.150 k
press: 1.00000 atm
elementType: 17 6 6 6 6 6 6 6 6 6 6 6 6 6 6 6 6 1 1 1 1 1 1 1 1 1 1 1 1 1 1 1
symmnumber: 1
zpe: 674982.0 jmol-1
zpe.correction: 0.257087 hartree
zpe.thermalcorrener: 0.272663 hartree
zpe.thermalcorrenthalpy: 0.273607 hartree
zpe.thermalcorrgfe: 0.212787 hartree
zpe.sumelectzpe: -1077.549700 hartree
zpe.sumelectthermal: -1077.534124 hartree
zpe.sumelectthermalent: -1077.533180 hartree
zpe.sumelectthermalfe: -1077.594000 hartree
dipole: 0.4482 2.1654 0.2967
dipole: 2.2311
quadrupole: -91.1946 -108.3494 -103.3011
quadrupole: 1.2438 0.3433 -0.8112
quadrupole: 9.7538 -7.4011 -2.3527 1.2438 0.3433 -0.8112
hfenergy: -1077.8067867 hartree
pointgroup: C01 [X(C16H15Cl1)]
dipole: 0.2161798 -0.7544262 -0.3932393 debye
polarizability: 283.5022206|3.4345988|148.983147|0.5869911|4.7777849|131.096004 unknown
InChI: InChI=1S/C16H15Cl/c1-2-15(13-9-5-3-6-10-13)16(17)14-11-7-4-8-12-14/h3-12H,2H2,1H3
charge 0 multiplicity 1
32 atoms
Cl 0.028059 2.149722 0.999791
C  -0.410976 -0.265691 -0.344524
C  -0.019925 -1.475637 -1.199323
C  -1.882857 -0.067815 -0.147855
C  0.548274 0.566723 0.164603
C  2.025611 0.421057 0.129423
C  -0.396093 -2.831489 -0.549549
C  -2.765262 -0.053115 -1.261631
C  -2.439193 0.047173 1.155299
C  2.858716 1.494852 -0.289627
C  2.639976 -0.794883 0.541331
C  -4.158459 0.091346 -1.081229
C  -3.832231 0.17945 1.337596
C  -4.699131 0.205051 0.220098
C  4.2605 1.347318 -0.323067
C  4.043988 -0.939898 0.50978
C  4.860539 0.128594 0.074221
H  1.057598 -1.453467 -1.432846
H  -0.553789 -1.396091 -2.167769
H  -1.478981 -2.884132 -0.339879
H  -0.134949 -3.668662 -1.222266
H  0.138726 -2.981115 0.406216
H  -2.360271 -0.129349 -2.277277
H  -1.773974 0.030197 2.024566
H  2.398262 2.442751 -0.586333
H  2.015136 -1.616128 0.908079
H  -4.819669 0.116625 -1.954723
H  -4.241084 0.262552 2.350874
H  -5.780408 0.311751 0.361857
H  4.886201 2.183143 -0.655222
H  4.499182 -1.881228 0.837278
H  5.950381 0.017997 0.054409
