program: Gaussian 09
title: 000297621
version: EM64L-G09RevD.01
frameworkgroup: C1[X(C7H9NO2)]
method: RPBEPBE
basis: SDD
operation: Freq
keyword: #pfreq=noraman
keyword: PBEPBE/SDD
title: #p freq=noraman PBEPBE/SDD
converged: NO YES NO NO
title: Mulliken charges:
elementType: O O N C C C C C C C H H H H H H H H H
charge: -0.410362 -0.235048 -0.084754 -0.380182 -0.473902 -0.199727 -0.199350 -0.301366 -0.301522 0.196825 0.242410 0.242519 0.273026 0.272843 0.248228 0.248224 0.241117 0.241103 0.379919
chargesum: 0.00000
title: Mulliken charges with hydrogens summed into heavy atoms:
elementType: O O N C C C C C C C
charge: -0.030443 -0.235048 -0.084754 0.104747 0.071966 0.048501 0.048874 -0.060249 -0.060419 0.196825
polarizability: 1.10331690e+02 -1.87637200e+00 7.47615594e+01 9.41439444e+00 2.34924086e+00 6.27115979e+01
1716.lowfreq: -13.9236 -2.3169 -0.0009 -0.0007 -0.0002 9.6926 17.0064 42.4233 70.4614
frequency: 15.3945 42.3297 70.3803 79.2120 182.9529 299.7538 336.2729 441.4761 503.6982 564.0522 610.2532 619.4392 640.4409 686.9206 713.5189 720.2842 781.0816 819.8955 863.3776 872.9050 881.3268 958.0553 1022.4685 1023.7403 1066.9083 1069.0291 1083.4459 1091.5342 1153.7855 1241.4504 1251.9875 1274.3446 1287.6500 1325.2189 1379.6776 1392.7212 1402.3650 1439.7225 1463.7094 1493.2136 1510.3479 1663.1792 3010.2424 3030.4628 3059.0716 3094.4696 3200.4846 3209.6016 3223.2852 3240.5587 3510.7570
redmass: 6.3742 3.5149 2.2448 5.0610 7.1426 6.5506 2.3725 4.4135 1.7798 4.9658 2.8618 3.4244 1.3218 1.3186 3.4076 1.3198 1.3437 1.3404 5.6734 1.3298 4.0361 2.2424 1.8853 3.3311 2.2604 1.3172 2.4523 1.2289 1.2300 1.5055 1.2669 1.2918 3.9036 1.7689 1.6358 2.8232 4.7103 1.0923 1.3832 2.0122 4.2483 8.2780 1.0614 1.0601 1.0996 1.1048 1.0875 1.0932 1.1021 1.1120 1.0640
irintensity: 1.0394 0.7317 0.2724 0.9396 2.7908 0.9949 0.0889 25.0082 29.3048 34.8939 0.0288 27.8626 132.4377 0.0521 12.7353 163.9711 8.2300 0.5182 0.0772 0.0029 1.7122 7.9724 15.1357 170.8786 6.6378 15.1031 138.1390 19.0896 2.3179 0.1525 0.0122 0.1432 61.1769 38.1722 85.8505 0.8122 0.0401 31.0700 12.4775 41.6454 0.2226 226.8936 4.9131 21.0749 0.3380 12.6849 1.3971 4.0009 6.8068 2.1546 21.2959
temp: 298.150 k
press: 1.00000 atm
elementType: 8 8 7 6 6 6 6 6 6 6 1 1 1 1 1 1 1 1 1
symmnumber: 1
zpe: 394279.9 jmol-1
zpe.correction: 0.150173 hartree
zpe.thermalcorrener: 0.159852 hartree
zpe.thermalcorrenthalpy: 0.160796 hartree
zpe.thermalcorrgfe: 0.112413 hartree
zpe.sumelectzpe: -476.586583 hartree
zpe.sumelectthermal: -476.576904 hartree
zpe.sumelectthermalent: -476.575960 hartree
zpe.sumelectthermalfe: -476.624343 hartree
dipole: 1.5705 0.1938 -0.8950
dipole: 1.8180
quadrupole: -57.5411 -54.3049 -65.7490
quadrupole: 0.7701 -3.4359 2.4754
quadrupole: 1.6573 4.8934 -6.5507 0.7701 -3.4359 2.4754
hfenergy: -476.7367559 hartree
pointgroup: C01 [X(C7H9N1O2)]
dipole: 0.6158129 0.0935856 -0.3515757 debye
dipolederiv: -0.8131379 -0.1381682 0.5317358 -0.1342144 -0.4510964 0.1048469 0.5169665 0.1052637 -0.8236949 -0.7188771 0.0544309 -0.2197474 -0.0116532 -0.3453941 0.1558948 0.0375257 0.1563509 -0.9171027 -0.9166352 0.0306934 -0.1374919 0.0680437 -0.0265714 0.0488983 -0.2868719 0.0479403 -0.2136967 0.7854081 -0.0035209 0.0241721 -0.0167697 0.1969067 -0.0160412 0.0794481 -0.0161646 0.2623106 -0.4510413 0.0179858 -0.0820836 0.0443702 0.1043343 0.0541617 -0.1923326 0.0539103 -0.0984954 0.2660888 0.0638239 0.1609722 0.2468349 -0.1168424 0.0619024 0.2702872 0.0264141 -0.1459077 0.2664556 -0.1290283 0.1137439 -0.3416928 -0.0895818 -0.031683 0.1262942 0.0044263 -0.1761054 -0.2082984 0.0047483 0.0523178 0.0690791 0.0103174 0.0662619 0.0351737 0.0624039 -0.2174475 -0.2073124 -0.0296179 0.0445233 -0.0782304 0.0143286 0.0544871 -0.0006866 0.057812 -0.2217784 1.4623795 0.0426318 -0.1412133 0.0679893 0.2799369 -0.3167829 -0.2360479 -0.3168752 1.4314522 0.0175189 0.0029238 -0.0080382 -0.055284 0.0087261 -0.1086234 -0.0138218 -0.0659757 -0.0172579 0.0185289 0.001194 -0.0087085 0.0548773 -0.0685618 0.0802013 0.0135415 0.0379483 0.0614523 0.0878941 -0.0219428 -0.0102879 -0.0158123 0.0434473 -0.0919386 0.0205602 -0.0625701 0.0145272 0.0877029 0.0251991 0.0007308 0.005695 -0.0272462 0.0696437 0.0254691 0.0405602 0.0852897 0.0769042 0.0950295 -0.0345635 0.0672619 -0.0068375 -0.0321991 -0.0489726 -0.0192107 0.1951277 0.0774076 -0.0681738 -0.0742816 -0.037163 0.0143983 -0.0617048 -0.0744135 -0.0743929 0.1732233 0.0094757 -0.0742784 -0.0805021 -0.0723851 0.0510875 -0.0610523 -0.0864671 -0.0582599 0.1632402 0.0087019 0.1029477 -0.0373111 0.1039595 0.0268032 -0.0101697 -0.0433456 -0.0129879 0.1880827 0.150836 0.0231222 -0.0939666 0.0350938 0.3818453 0.0338967 -0.1423066 0.0334069 0.2567808 unknown
polarizability: 110.438024|-2.0516257|74.530697|9.1006812|2.8839512|62.8361266 unknown
InChI: InChI=1S/C7H9NO2/c9-7(10)3-6-8-4-1-2-5-8/h1-2,4-5,9H,3,6H2
charge 0 multiplicity 1
19 atoms
O  3.554703 0.314224 -1.153562
O  3.178088 -0.257328 1.066942
N  -1.089712 -0.088286 0.35531
C  0.32506 -0.179014 0.738875
C  1.261736 0.123457 -0.4531
C  -1.8551 -1.131721 -0.176774
C  -1.858986 1.080381 0.362896
C  -3.121082 -0.625014 -0.498379
C  -3.123448 0.774608 -0.157045
C  2.72206 0.030638 -0.061933
H  0.523828 0.528497 1.56211
H  0.530318 -1.189634 1.131539
H  1.074401 -0.577238 -1.288011
H  1.068158 1.133997 -0.858586
H  -1.44779 -2.13762 -0.26771
H  -1.455263 2.016557 0.745788
H  -3.947773 -1.196872 -0.917274
H  -3.952428 1.472342 -0.266054
H  4.506732 0.245927 -0.868631
