program: Gaussian 09
title: 000297648
version: EM64L-G09RevD.01
frameworkgroup: C1[X(C21H13FO3)]
method: RPBEPBE
basis: SDD
operation: Freq
keyword: #p
keyword: freq=noraman
keyword: PBEPBE/SDD
title: #p freq=noraman PBEPBE/SDD
converged: NO YES NO NO
title: Mulliken charges:
elementType: F O O O C C C C C C C C C C C C C C C C C C C C C H H H H H H H H H H H H H
charge: -0.194208 -0.229266 -0.229281 -0.170868 -0.552657 -0.586060 -0.139988 -0.136806 0.267934 0.451774 0.404984 0.391671 0.235689 -0.711092 -0.451108 -0.450278 0.239711 0.181884 0.125531 -0.232145 -0.231493 -0.409633 -0.395463 -0.245679 -0.231532 0.263509 0.277986 0.279244 0.278869 0.274056 0.244847 0.246203 0.229812 0.230235 0.232314 0.270937 0.233198 0.237166
chargesum: 0.00000
title: Mulliken charges with hydrogens summed into heavy atoms:
elementType: F O O O C C C C C C C C C C C C C C C C C C C C C
charge: -0.194208 -0.229266 -0.229281 -0.170868 -0.289148 -0.308074 0.139256 0.142063 0.267934 0.451774 0.404984 0.391671 0.235689 -0.437036 -0.206261 -0.204075 0.239711 0.181884 0.125531 -0.002333 -0.001257 -0.177319 -0.124526 -0.012481 0.005634
polarizability: 3.06002975e+02 -2.04961902e+01 2.25709055e+02 -1.86410383e+01 -7.52141068e+00 1.53580153e+02
1716.lowfreq: -4.7896 -1.7963 -0.0008 -0.0007 0.0006 12.4982 45.8225 58.8076 61.6457
frequency: 45.8181 58.8021 61.6378 80.5307 125.2305 137.6623 144.2748 169.6951 204.6709 245.4647 247.4331 277.0415 291.6657 301.5055 326.8347 409.1215 422.2119 429.7538 450.3977 468.4531 490.0184 501.8827 526.2239 534.1303 558.2457 569.3871 596.2362 618.8830 634.1031 646.5951 660.7778 676.9896 697.1207 708.5696 746.7608 762.3164 767.9686 773.6669 775.8705 786.0982 789.6307 811.9372 823.5823 832.7607 876.4034 880.5670 882.6073 908.1752 950.1470 957.8078 958.5305 969.5600 977.8558 984.2712 991.6448 998.5349 1007.8855 1020.7551 1023.8353 1029.9860 1058.8635 1074.4142 1108.1450 1148.9858 1165.7316 1169.9482 1173.8734 1174.6340 1179.5564 1207.2560 1212.6429 1222.6360 1224.2076 1270.0920 1281.8083 1290.8514 1297.0316 1301.9725 1328.9573 1330.5631 1377.0957 1383.6655 1397.9785 1419.2201 1436.5686 1450.5145 1452.1263 1476.3462 1523.4526 1578.4246 1598.2284 1602.4060 1620.5981 1637.1810 1742.2760 3065.3809 3074.6303 3082.7810 3092.0540 3127.0631 3133.0551 3133.3851 3146.1812 3146.6824 3159.9949 3164.8675 3165.6859 3173.8074
redmass: 6.0508 6.7653 8.3018 8.3420 6.7985 4.2590 4.9876 6.0613 6.4112 7.3751 5.9320 9.7674 7.7347 6.2254 4.9814 4.5554 3.6215 4.2260 6.9009 5.7882 6.3876 4.2822 5.7329 6.0347 5.7898 4.7793 5.2760 3.5251 5.2757 6.3831 12.2282 8.2026 6.1091 5.3627 5.6570 3.4781 1.7847 2.2291 2.1594 3.5865 4.3480 3.7514 3.2390 3.7800 1.4311 1.6027 1.9114 3.7523 1.6452 3.9490 4.0631 1.4195 6.0605 5.6218 1.3367 1.3342 3.9422 6.5881 2.4217 2.0894 3.4298 3.6863 1.9746 1.2851 1.7221 1.3525 1.8143 1.0645 1.2564 1.5420 1.4137 1.6933 1.6485 1.6491 2.0173 1.4490 1.8393 1.4445 1.4029 1.5718 3.0238 4.2400 5.7222 4.2918 3.8297 2.6236 2.5617 2.6681 4.5607 7.6684 6.6419 6.8285 7.0901 7.4564 13.0102 1.0876 1.0877 1.0882 1.0891 1.0860 1.0857 1.0896 1.0896 1.0944 1.0953 1.0929 1.1004 1.0997
irintensity: 0.1747 0.4279 3.0990 2.5946 0.2044 0.1705 0.2347 0.3927 1.9616 1.6719 0.2898 0.3232 1.6619 1.2163 0.3857 3.2202 2.9530 0.0070 1.9519 0.4003 0.5772 5.8687 3.5360 4.5043 6.0660 2.4568 54.7495 2.9887 7.3274 0.6545 22.7879 0.9999 8.9143 2.2144 4.0215 10.7370 24.7154 51.3392 32.2790 3.1138 7.9737 3.1495 9.3449 16.1625 17.2434 1.0341 4.4888 9.5780 16.8039 65.4313 3.9103 7.2326 253.2647 120.8294 0.1735 0.3398 0.4250 46.4880 6.9568 17.5218 10.1776 1.5151 4.6249 16.0834 1.3359 0.2186 4.8402 0.3769 0.8449 7.1455 4.4871 8.1484 10.5713 3.7014 15.2829 11.1716 10.4538 1.6954 2.2329 2.8495 29.8020 37.6918 0.1271 3.3662 5.0302 22.5654 5.5917 14.6248 12.0414 6.0649 34.9992 7.1756 1.1429 15.9175 613.2022 0.5342 16.2071 28.4310 16.2872 1.8941 0.8210 2.3722 11.1856 21.8464 15.6474 3.3581 29.0593 20.2894
temp: 298.150 k
press: 1.00000 atm
elementType: 9 8 8 8 6 6 6 6 6 6 6 6 6 6 6 6 6 6 6 6 6 6 6 6 6 1 1 1 1 1 1 1 1 1 1 1 1 1
symmnumber: 1
zpe: 742823.2 jmol-1
zpe.correction: 0.282926 hartree
zpe.thermalcorrener: 0.300439 hartree
zpe.thermalcorrenthalpy: 0.301383 hartree
zpe.thermalcorrgfe: 0.237783 hartree
zpe.sumelectzpe: -1131.877366 hartree
zpe.sumelectthermal: -1131.859854 hartree
zpe.sumelectthermalent: -1131.858910 hartree
zpe.sumelectthermalfe: -1131.922510 hartree
dipole: 4.6901 -0.4714 1.4503
dipole: 4.9318
quadrupole: -164.8677 -132.0746 -140.6205
quadrupole: -14.8991 -15.7690 -3.4696
quadrupole: -19.0134 13.7796 5.2338 -14.8991 -15.7690 -3.4696
hfenergy: -1132.1602927 hartree
pointgroup: C01 [X(C21H13F1O3)]
dipole: 1.8534156 -0.4995501 -0.2830456 debye
polarizability: 306.2572173|24.0225688|154.4536703|-13.9754061|-9.659189|224.5812954 unknown
InChI: InChI=1S/C21H13FO3/c22-15-9-14-16(11-6-2-1-5-10(11)15)18-13-8-4-3-7-12(13)17(14)19-20(18)25-21(23)24-19/h1-9,17-20H
charge 0 multiplicity 1
38 atoms
F  3.894554 -0.46135 2.645567
O  -2.454516 1.898747 -1.010456
O  -2.935424 1.49217 1.217401
O  -4.688402 1.888011 -0.291622
C  -0.439903 0.383014 -1.013519
C  -0.979275 -0.072155 1.513732
C  -1.134159 1.637911 -0.38573
C  -1.460359 1.365399 1.125182
C  0.814416 0.18351 -0.156686
C  0.516837 -0.061001 1.196894
C  -1.368409 -0.809639 -0.798721
C  -1.662013 -1.055143 0.567698
C  2.174227 0.226869 -0.612584
C  1.544879 -0.275185 2.155665
C  -1.935787 -1.612735 -1.804855
C  -2.521813 -2.105691 0.936132
C  -3.488833 1.762319 -0.055826
C  3.236597 0.00207 0.354012
C  2.860335 -0.241707 1.711081
C  -2.789334 -2.681366 -1.436561
C  -3.080511 -2.926709 -0.073867
C  2.551074 0.476404 -1.974613
C  4.606396 0.028379 -0.062139
C  3.893966 0.499547 -2.358186
C  4.92993 0.273425 -1.397662
H  -0.230622 0.563822 -2.078204
H  -1.189532 -0.277582 2.575134
H  -0.519929 2.539498 -0.533867
H  -1.026384 2.120634 1.798366
H  1.320672 -0.468287 3.20871
H  -1.724965 -1.411004 -2.861192
H  -2.762218 -2.282408 1.990543
H  -3.232063 -3.316654 -2.211379
H  -3.747327 -3.751096 0.201193
H  1.773545 0.648581 -2.72583
H  5.387542 -0.146578 0.683284
H  4.159338 0.690859 -3.403526
H  5.977867 0.293021 -1.714672
