program: Gaussian 09
title: 000297647
version: EM64L-G09RevD.01
frameworkgroup: C1[X(C21H14O3)]
method: RPBEPBE
basis: SDD
operation: Freq
keyword: #pfreq=noraman
keyword: PBEPBE/SDD
title: #p freq=noraman PBEPBE/SDD
converged: NO YES NO NO
title: Mulliken charges:
elementType: O O O C C C C C C C C C C C C C C C C C C C C C H H H H H H H H H H H H H H
charge: -0.229879 -0.230253 -0.172781 -0.554557 -0.587490 -0.139336 -0.135917 0.261719 0.398521 0.405183 0.397282 0.164516 -0.505219 -0.453166 -0.452997 0.238476 0.420996 -0.485878 -0.232830 -0.232555 -0.399451 -0.441034 -0.251827 -0.243220 0.261120 0.274491 0.278660 0.277228 0.247485 0.244386 0.245175 0.241798 0.228641 0.228862 0.227799 0.242942 0.231044 0.232068
chargesum: 0.00000
title: Mulliken charges with hydrogens summed into heavy atoms:
elementType: O O O C C C C C C C C C C C C C C C C C C C C C
charge: -0.229879 -0.230253 -0.172781 -0.293437 -0.312999 0.139324 0.141310 0.261719 0.398521 0.405183 0.397282 0.164516 -0.257734 -0.208780 -0.207822 0.238476 0.420996 -0.244080 -0.004190 -0.003693 -0.171652 -0.198092 -0.020784 -0.011153
polarizability: 3.07291752e+02 -1.97723871e+01 1.52711958e+02 -1.41642499e+01 -4.06602267e+00 2.22089365e+02
1716.lowfreq: 0.0005 0.0007 0.0008 5.1452 9.2720 12.6897 46.9039 61.0249 74.5617
frequency: 46.9003 61.0053 74.5562 79.2795 124.7612 138.8248 163.8737 172.5225 225.3113 260.6385 282.6692 311.5700 329.4643 373.7322 417.9584 427.9634 448.4215 465.8794 474.6191 503.5482 515.8796 527.9099 546.4428 573.5214 583.7379 614.9074 643.4224 660.0622 665.7303 677.3060 701.4650 727.3499 744.6361 758.1043 765.5565 773.5201 776.3314 793.1099 805.4273 814.2024 832.5453 840.0905 863.6507 877.8026 884.7570 905.7577 949.8531 955.4516 958.6621 961.3193 975.5177 978.5788 986.1497 990.7438 994.9616 1009.0931 1024.6403 1028.2015 1058.7913 1062.4478 1108.1371 1149.2287 1152.5313 1166.4957 1173.1698 1174.3625 1182.8829 1184.6026 1209.7627 1223.3361 1224.2864 1237.2194 1257.7602 1271.8297 1292.6897 1296.6036 1302.2714 1328.9656 1333.3048 1373.7929 1398.0792 1404.7853 1416.2492 1437.1549 1451.3910 1456.4406 1477.5799 1524.5744 1581.3595 1595.4002 1602.2387 1621.5671 1634.2954 1745.8156 3065.6379 3072.7757 3082.4439 3091.2500 3123.3419 3124.6819 3126.8151 3133.3908 3133.9584 3146.4995 3147.4358 3149.2857 3165.3081 3165.5243
redmass: 5.6915 7.8958 4.5501 8.1919 6.9689 4.1735 4.9783 5.8482 4.3632 7.8775 6.3378 6.4091 4.8805 4.8653 3.2539 3.9748 4.3851 4.9646 6.5349 4.1986 5.8235 4.9101 5.3403 4.1855 4.1663 4.9082 6.2130 12.1041 6.1956 9.1096 3.9778 3.8869 4.8676 1.3639 5.5320 1.4658 5.4450 4.0522 3.6263 2.8116 3.6734 1.6525 3.1073 2.0199 1.7621 3.4255 1.5514 1.8489 4.4263 2.4228 1.4013 6.5610 5.4264 1.3360 1.3555 3.7620 2.3874 2.2589 3.2514 3.3289 1.9751 1.2883 1.3650 1.5164 2.0909 1.0662 1.3235 1.3204 1.5729 1.8951 1.4095 1.7518 2.5129 1.6093 1.4321 1.4002 1.3854 1.4630 1.4976 2.3302 6.3157 3.7808 4.9982 2.9547 2.4646 2.3650 2.6742 4.1704 7.5979 6.0143 6.8019 7.1199 6.8235 13.0113 1.0875 1.0878 1.0880 1.0895 1.0867 1.0866 1.0858 1.0898 1.0877 1.0946 1.0975 1.0947 1.1005 1.1004
irintensity: 0.0815 2.5125 0.1198 2.2701 0.2103 0.1058 0.2102 0.3736 3.3924 0.6065 1.4021 0.9144 0.0996 1.5749 4.0990 0.3284 3.8061 1.2709 0.1497 9.9013 5.3608 8.3453 1.2823 16.3690 5.3576 14.3522 6.1632 23.1670 3.4946 2.0499 3.1656 11.3143 0.3247 63.8762 1.8388 26.5749 1.2068 3.7796 9.6543 1.7869 28.8626 39.9876 0.6195 3.1053 10.1601 5.3725 10.1048 0.9387 64.6378 4.7807 3.7877 270.5390 116.7347 0.2068 0.7065 0.3359 4.2689 9.4641 6.5676 4.8875 4.6411 15.5976 0.8666 8.2981 4.4121 0.4286 1.7373 2.2553 2.5606 8.8925 0.2336 3.7704 11.1404 3.3066 3.3414 6.0676 3.5593 2.4972 1.0628 12.7769 0.4839 4.4789 0.7801 1.1945 7.2934 2.6815 15.4670 9.7046 1.8715 5.4027 0.3941 0.2434 2.5352 617.9470 0.2045 17.2064 26.8766 19.1173 1.6043 3.9631 1.7440 2.6547 2.0197 19.3465 18.5786 42.0043 43.1069 17.8607
temp: 298.150 k
press: 1.00000 atm
elementType: 8 8 8 6 6 6 6 6 6 6 6 6 6 6 6 6 6 6 6 6 6 6 6 6 1 1 1 1 1 1 1 1 1 1 1 1 1 1
symmnumber: 1
zpe: 765069.6 jmol-1
zpe.correction: 0.291400 hartree
zpe.thermalcorrener: 0.307926 hartree
zpe.thermalcorrenthalpy: 0.308870 hartree
zpe.thermalcorrgfe: 0.247445 hartree
zpe.sumelectzpe: -1032.707496 hartree
zpe.sumelectthermal: -1032.690969 hartree
zpe.sumelectthermalent: -1032.690025 hartree
zpe.sumelectthermalfe: -1032.751451 hartree
dipole: 6.0095 1.4967 1.5130
dipole: 6.3752
quadrupole: -150.7571 -138.2695 -123.9751
quadrupole: -16.0054 -6.3825 -3.8571
quadrupole: -13.0898 -0.6023 13.6921 -16.0054 -6.3825 -3.8571
hfenergy: -1032.9988953 hartree
pointgroup: C01 [X(C21H14O3)]
dipole: 2.3679324 0.5751313 0.5942292 debye
polarizability: 306.9639102|-21.733491|153.0306498|-13.3795359|-2.5860297|222.0985152 unknown
InChI: InChI=1S/C21H14O3/c22-21-23-19-17-13-7-3-4-8-14(13)18(20(19)24-21)16-12-6-2-1-5-11(12)9-10-15(16)17/h1-10,17-20H
charge 0 multiplicity 1
38 atoms
O  -2.18538 -1.744859 -1.328502
O  -2.839228 -1.658405 0.889214
O  -4.465952 -1.845907 -0.790046
C  -0.208232 -0.224406 -0.965831
C  -0.938782 -0.137999 1.553555
C  -0.920449 -1.561211 -0.574701
C  -1.363837 -1.508401 0.930359
C  0.976501 -0.139942 0.00371
C  0.577698 -0.094621 1.351851
C  -1.171381 0.918082 -0.654323
C  -1.568753 0.96378 0.707443
C  2.36599 -0.118121 -0.351128
C  1.537759 -0.024449 2.400378
C  -1.674215 1.855153 -1.57523
C  -2.470252 1.946044 1.155131
C  -3.290249 -1.749243 -0.446983
C  3.343007 -0.04009 0.723218
C  2.899001 0.005914 2.086309
C  -2.56999 2.855408 -1.124064
C  -2.965958 2.900478 0.233127
C  2.841335 -0.166965 -1.70529
C  4.739999 -0.011441 0.397639
C  4.208384 -0.139092 -1.988317
C  5.168286 -0.060474 -0.929348
H  0.08115 -0.249548 -2.026843
H  -1.230382 -0.087418 2.61475
H  -0.279153 -2.426896 -0.801388
H  -0.969112 -2.348514 1.522153
H  1.204281 0.009831 3.44359
H  -1.380821 1.809609 -2.630121
H  -2.79043 1.969483 2.202832
H  3.649772 0.066457 2.882802
H  -2.963367 3.593323 -1.831717
H  -3.664853 3.673103 0.571682
H  2.12269 -0.223531 -2.529474
H  5.469265 0.049275 1.214317
H  4.553835 -0.175936 -3.027244
H  6.237121 -0.038568 -1.167708
