program: Gaussian 09
title: 000297617
version: EM64L-G09RevD.01
frameworkgroup: C1[X(C9H10N2O3)]
method: RPBEPBE
basis: SDD
operation: Freq
keyword: #p
keyword: freq=noraman
keyword: PBEPBE/SDD
title: #p freq=noraman PBEPBE/SDD
converged: YES YES NO NO
title: Mulliken charges:
elementType: O O O N N C C C C C C C C C H H H H H H H H H H
charge: -0.244263 -0.267562 -0.239168 -0.043272 -0.048440 0.390677 -0.322222 -0.359166 -0.195746 -0.192980 -0.230935 -0.383968 0.314907 -0.746895 0.295931 0.290064 0.237549 0.237446 0.236959 0.256508 0.259826 0.257253 0.247817 0.249680
chargesum: 0.00000
title: Mulliken charges with hydrogens summed into heavy atoms:
elementType: O O O N N C C C C C C C C C
charge: -0.244263 -0.267562 -0.239168 -0.043272 -0.048440 0.390677 -0.026291 -0.069102 0.041803 0.044466 0.006024 0.132366 0.314907 0.007854
polarizability: 1.87408373e+02 9.79544423e-01 1.21846096e+02 1.51141020e+01 1.06629133e+01 7.79843156e+01
1716.lowfreq: -51.7554 -9.9845 -3.9456 -0.0009 -0.0006 -0.0004 5.1303 23.9338 29.4261
frequency: -51.7477 23.6996 29.3324 47.3094 59.0348 130.2791 164.0946 199.4598 240.4154 313.2215 364.1230 406.3720 410.9251 436.8021 477.3427 530.8132 578.7899 609.5797 610.7442 662.7427 682.5060 690.6056 763.0537 785.5469 804.3372 857.1387 896.4757 956.0135 961.7129 989.4514 995.5671 996.5796 1007.7488 1019.3961 1045.0981 1076.4042 1088.0630 1123.0467 1169.9389 1172.8239 1182.3349 1239.7101 1263.1817 1302.1717 1325.9058 1368.4230 1383.3496 1395.9233 1442.0808 1453.4849 1454.6316 1458.4994 1463.5149 1599.0812 1605.2918 1659.0114 3009.4574 3044.0025 3098.5137 3126.7801 3137.9760 3143.0446 3151.8760 3166.7846 3186.5927 3192.2973
redmass: 1.0482 4.9650 6.7633 4.5491 6.0645 5.2307 5.2708 6.2495 5.7803 3.7915 4.2616 2.8847 3.7978 3.8978 4.9182 4.7389 3.7952 5.4662 5.0614 5.4890 6.3029 1.9946 4.3275 1.7723 5.2936 1.2428 8.9562 1.4280 5.9386 6.2889 1.3721 1.9473 1.3238 2.0908 1.6244 1.4869 2.3537 2.9931 1.9957 1.0618 1.6247 7.5989 1.1338 1.5421 2.8276 1.3455 1.2266 9.4202 1.2577 1.5984 1.2316 1.0476 2.1820 6.2032 7.0302 10.1452 1.0367 1.0542 1.0966 1.1108 1.0861 1.1014 1.0908 1.0964 1.0953 1.0965
irintensity: 1.4019 0.9457 1.3924 2.9294 1.6254 1.9813 0.7393 2.5163 1.6225 3.3471 10.8310 0.0318 21.5378 9.4455 5.9549 6.4525 9.7244 1.8547 6.6590 5.4147 3.3299 66.5278 10.2852 51.1879 8.3389 0.0310 232.6887 9.0810 24.4021 0.1616 0.0664 39.9232 1.5496 18.2249 8.5622 19.6151 10.7967 12.4421 320.4358 2.6907 109.5989 100.3323 7.3574 19.0620 99.7905 8.8835 52.5048 2.2026 14.0410 8.3886 35.2657 18.1660 12.8386 3.4953 0.2488 210.4673 2.6939 27.6566 7.5941 4.1511 0.4862 7.1318 16.5002 18.5514 3.4290 7.6133
temp: 298.150 k
press: 1.00000 atm
elementType: 8 8 8 7 7 6 6 6 6 6 6 6 6 6 1 1 1 1 1 1 1 1 1 1
symmnumber: 1
zpe: 473903.7 jmol-1
zpe.correction: 0.180500 hartree
zpe.thermalcorrener: 0.192947 hartree
zpe.thermalcorrenthalpy: 0.193891 hartree
zpe.thermalcorrgfe: 0.138799 hartree
zpe.sumelectzpe: -683.025689 hartree
zpe.sumelectthermal: -683.013242 hartree
zpe.sumelectthermalent: -683.012298 hartree
zpe.sumelectthermalfe: -683.067390 hartree
dipole: 2.5936 -0.3686 1.2764
dipole: 2.9141
quadrupole: -65.4212 -84.1218 -78.8681
quadrupole: -7.1224 -3.1217 -2.8365
quadrupole: 10.7158 -7.9848 -2.7310 -7.1224 -3.1217 -2.8365
hfenergy: -683.206189 hartree
pointgroup: C01 [X(C9H10N2O3)]
dipole: -1.0282808 -0.1158956 -0.4936027 debye
dipolederiv: -1.2930179 0.486859 0.1417464 0.6327175 -0.7805201 -0.1482451 0.5236404 -0.2099019 -0.5207381 -0.5580501 -0.1376233 -0.0489426 0.2005794 -0.7665183 0.1410437 -0.1611513 0.0994135 -0.2736821 -0.5915108 0.1438271 0.0755499 0.4468018 -0.736603 0.1362868 -0.134691 0.3353757 -0.6771198 1.1631062 0.082294 0.2162411 -0.1554647 0.8564736 -0.160778 0.3749215 -0.2076079 0.2320823 -0.9685645 0.1783557 -0.1678957 0.131974 -0.3697959 0.017719 -0.337332 0.0713006 -0.405969 -0.1932339 -0.1037894 -0.0327811 -0.1427506 -0.0039377 -0.0297195 -0.0319388 -0.0134077 0.0384704 0.0014554 -0.0513649 0.0576424 0.1612784 -0.0505081 0.0212674 -0.0236545 -0.0298918 -0.0906484 0.0725301 0.1382463 0.006488 -0.0859307 -0.0365632 -0.0381301 0.087073 0.0152647 -0.1026045 -0.2187933 0.0757542 -0.0374422 0.099931 0.1351696 -0.0660711 -0.054195 -0.0661711 -0.1409746 -0.0472308 -0.1581392 0.0906702 -0.2236421 -0.0567617 -0.0820087 0.1024862 -0.0781305 -0.0942234 0.1110502 0.061127 0.0621185 0.0606437 0.0153406 -0.0301094 0.0550643 -0.028302 -0.1040212 1.184525 -0.189818 0.042845 0.1024368 0.2271096 0.1184753 -0.3068715 0.2178685 0.5119982 1.1538644 -0.6016341 -0.3342572 -1.2217138 1.2330459 -0.0522719 -0.1963144 -0.2532055 0.9443737 -0.1298467 0.0431498 0.180721 0.1542504 -0.0263977 -0.081118 0.2155828 -0.0310709 -0.2955235 0.1065171 0.0588559 -0.0434704 0.0567379 0.0985702 0.03138 -0.0360485 0.0366675 0.1435264 0.1675315 -0.0495162 0.0050881 -0.0179794 0.0428473 0.0380372 0.0048816 0.026669 0.1617325 0.0633657 -0.0446118 -0.0112855 -0.0691237 -0.0723084 0.0557776 -0.0059497 0.0588471 0.1361551 -0.0170052 0.0655716 -0.0701857 0.0784188 0.0249207 0.0656384 -0.0788805 0.0629877 0.115232 -0.0829737 -0.0685739 -0.0495909 -0.0728981 0.0808917 0.0037376 -0.0508292 0.0037129 0.143594 -0.0593617 0.052066 0.0153502 -0.0884833 -0.0286496 -0.1087255 0.0425756 -0.0147174 0.0734089 0.0085086 0.0132352 -0.0485109 -0.0247054 0.1050033 0.1022926 0.0387631 -0.0102732 0.0062904 0.1230938 0.0463056 -0.0103717 0.0106049 -0.0182018 0.1037611 -0.010426 0.0642712 0.0628842 -0.0862021 0.0258314 -0.0064091 0.0261834 0.1279983 0.0319358 -0.0326845 0.0078434 0.0844447 0.0902427 -0.0664082 -0.0333177 -0.0598659 -0.0006053 -0.0701752 0.0159784 -0.0575419 0.0513117 unknown
polarizability: 187.2087147|-3.7673937|120.8461785|14.3897126|-13.6492648|79.1838913 unknown
InChI: InChI=1S/C9H10N2O3/c1-8(12)14-7-10-11(13)9-5-3-2-4-6-9/h2-6H,7H2,1H3
charge 0 multiplicity 1
24 atoms
O  2.825827 0.493051 -0.081109
O  0.051936 2.089084 0.070583
O  3.796385 -1.497364 0.684417
N  -0.182021 0.839014 0.397976
N  0.680803 -0.011501 0.942069
C  -1.537686 0.306777 0.15109
C  -1.8514 -1.032229 0.479299
C  -2.489516 1.178084 -0.420884
C  -3.15743 -1.499675 0.226642
C  -3.791534 0.693572 -0.666927
C  -4.128351 -0.641998 -0.344712
C  2.012046 0.574698 1.170584
C  3.665705 -0.633151 -0.20737
C  4.363953 -0.617391 -1.549339
H  -1.081809 -1.671359 0.917554
H  -2.196685 2.20358 -0.659438
H  -3.417625 -2.53381 0.475396
H  -4.540821 1.357569 -1.110181
H  -5.140475 -1.01359 -0.537912
H  1.980259 1.651801 1.401284
H  2.493995 -0.034382 1.950489
H  4.168164 0.318235 -2.091597
H  5.448432 -0.752988 -1.400836
H  4.005251 -1.471027 -2.151577
