program: Gaussian 09
title: 000297614
version: EM64L-G09RevD.01
frameworkgroup: C1[X(C7H14N2O)]
method: RPBEPBE
basis: SDD
operation: Freq
keyword: #p
keyword: freq=noraman
keyword: PBEPBE/SDD
title: #p freq=noraman PBEPBE/SDD
converged: NO YES NO NO
title: Mulliken charges:
elementType: O N N C C C C C C C H H H H H H H H H H H H H H
charge: -0.312588 0.034147 -0.072014 -0.024696 -0.429938 -0.429937 -0.387497 -0.387485 -0.394945 -0.662042 0.251714 0.229217 0.213978 0.213984 0.229185 0.206802 0.196358 0.196358 0.206800 0.204117 0.197269 0.245768 0.245767 0.229677
chargesum: 0.00000
title: Mulliken charges with hydrogens summed into heavy atoms:
elementType: O N N C C C C C C C
charge: -0.312588 0.034147 -0.072014 0.227017 0.013257 0.013232 0.015663 0.015673 0.006442 0.059170
polarizability: 1.18195099e+02 1.09830918e-03 7.78630016e+01 5.48869974e+00 5.60261733e-03 8.36106227e+01
1716.lowfreq: -15.6970 -0.0008 0.0002 0.0003 16.8124 20.3142 43.8699 100.6320 131.6737
frequency: 43.4134 100.5751 131.6630 166.9290 223.4884 239.2748 289.6849 306.6350 320.9335 367.8709 428.2296 483.9019 505.5511 662.2374 711.2940 788.2281 794.3224 839.2559 872.0689 884.9874 896.2461 925.0471 978.8676 1002.6024 1044.2147 1048.6290 1054.6963 1078.7376 1111.3029 1135.5141 1149.3001 1191.7446 1204.1867 1243.1264 1255.6082 1261.6894 1282.3922 1309.4544 1331.5967 1336.7467 1339.2877 1342.0605 1355.2144 1382.6165 1430.4161 1445.9679 1456.2863 1464.0940 1465.3196 1466.1457 1472.8938 1483.1744 2961.2837 2971.8742 2972.2218 2974.7399 2993.0778 2995.6443 3033.8055 3035.0154 3035.3478 3038.2003 3045.6502 3058.1816 3071.1982 3126.9585
redmass: 4.3617 3.0275 3.0905 1.0995 1.7974 2.7047 5.5688 3.6809 2.3866 2.4022 3.1740 2.7893 1.6869 8.6934 3.2082 1.4292 2.5229 2.5718 2.1125 2.2418 1.5311 1.8246 4.2244 2.7032 1.3832 1.8260 1.1291 1.3561 2.4265 1.6853 2.3423 1.5095 2.9031 1.7562 1.2774 1.3212 1.4719 1.3001 1.4115 1.3934 1.6346 1.4826 1.5452 1.5292 1.5139 1.0471 1.2724 1.0860 1.0894 1.0885 1.0867 1.0924 1.0358 1.0629 1.0648 1.0615 1.0600 1.0610 1.0974 1.0983 1.0950 1.0900 1.1012 1.1040 1.1000 1.0991
irintensity: 1.1349 0.4713 0.2473 0.3634 0.2679 5.4000 3.5293 10.9223 11.1743 5.7656 0.0066 2.3162 0.1032 1.3517 10.8233 0.3257 2.4651 1.6664 9.3331 1.1122 15.9713 0.0049 7.6377 5.8902 0.0837 0.1312 0.4045 0.2274 0.0728 8.4753 4.3694 0.0225 28.1027 1.0790 0.8059 1.5099 2.6334 0.2866 0.1975 0.2438 15.2217 0.3117 7.5815 40.9891 13.4796 16.6940 33.4092 2.3697 10.4857 12.4991 23.9479 6.1925 23.5864 24.8987 40.8785 33.1649 28.7288 10.6351 14.7184 75.6448 58.8032 2.0291 41.4198 8.9006 57.8786 21.6797
temp: 298.150 k
press: 1.00000 atm
elementType: 8 7 7 6 6 6 6 6 6 6 1 1 1 1 1 1 1 1 1 1 1 1 1 1
symmnumber: 1
zpe: 546806.6 jmol-1
zpe.correction: 0.208268 hartree
zpe.thermalcorrener: 0.218468 hartree
zpe.thermalcorrenthalpy: 0.219412 hartree
zpe.thermalcorrgfe: 0.172544 hartree
zpe.sumelectzpe: -458.996005 hartree
zpe.sumelectthermal: -458.985804 hartree
zpe.sumelectthermalent: -458.984860 hartree
zpe.sumelectthermalfe: -459.031728 hartree
dipole: 1.3704 -0.0003 -1.0631
dipole: 1.7344
quadrupole: -55.5650 -59.7494 -66.8956
quadrupole: -0.0001 1.3173 -0.0035
quadrupole: 5.1716 0.9873 -6.1589 -0.0001 1.3173 -0.0035
hfenergy: -459.2042722 hartree
pointgroup: C01 [X(C7H14N2O1)]
dipole: 0.5382362 0.0000638 -0.4194295 debye
dipolederiv: -0.5491235 -0.0000135 0.0956757 -0.0001971 -0.2571207 -0.0001762 -0.3523534 0.0001607 -0.7912653 0.4193898 -0.0000053 0.1193479 0.0003989 -0.0498495 0.0001064 0.3066463 -0.0000386 0.8224179 -0.3582667 -0.0000224 -0.2151293 -0.0000321 -0.2522815 0.0001087 -0.1896689 -0.0000941 -0.4759226 0.2499765 -0.0000135 0.0372079 -0.0002009 0.1966818 -0.000047 -0.0281005 -0.0000119 0.1289801 -0.0448966 0.0077057 0.02128 0.0765182 0.0574079 -0.0374354 0.0804821 -0.0103263 0.0823002 -0.0448515 -0.0077144 0.0212966 -0.0765077 0.0573738 0.0374152 0.0803439 0.0102808 0.0823846 0.0834315 0.0240659 0.0055273 -0.0488988 0.0508996 0.0190182 -0.0645717 -0.015891 0.1714509 0.0834535 -0.0240577 0.0055118 0.0488743 0.0508992 -0.0190912 -0.0645066 0.0158077 0.1714237 0.0692869 0.0000085 -0.0216309 -0.0000163 0.0397416 -0.0000371 0.0301173 -0.0000324 0.1376322 0.1437306 -0.0000127 0.1290451 -0.0000119 0.2131104 -0.0000572 0.2733688 -0.0000147 0.1529211 0.031064 0.0000204 -0.0167901 -0.0000215 0.0443924 0.0000461 0.008384 0.0000235 -0.0717826 0.0775049 -0.0164581 0.0155597 -0.0158502 0.075917 0.034882 0.0078342 -0.0297337 -0.100345 -0.015252 0.1070853 -0.0386314 0.0789942 -0.1141335 0.041415 -0.0512484 0.0702989 0.0540125 -0.0152068 -0.1070427 -0.0386917 -0.0789521 -0.1140944 -0.0415227 -0.0512637 -0.0704202 0.0539531 0.0774374 0.0164579 0.0155754 0.0158474 0.0759197 -0.0347729 0.0078752 0.0298756 -0.1004199 -0.0459124 -0.0995658 -0.0242409 -0.1056757 -0.1418407 -0.0505851 -0.0416775 -0.0818215 0.0572651 0.0317622 0.026933 -0.0099329 0.037709 0.0681514 -0.0123066 0.0422658 0.0503492 -0.1884241 0.0317786 -0.0269381 -0.0099485 -0.037737 0.0681721 0.0124775 0.0422357 -0.0501666 -0.1884465 -0.0459388 0.0996147 -0.024184 0.1057452 -0.1419117 0.0504499 -0.0416298 0.0816847 0.057354 -0.2327915 -0.000036 0.0506164 -0.0000496 0.0388653 -0.0000018 0.0870122 -0.000001 0.0630559 0.093898 -0.0000026 0.023508 0.0000218 0.0183635 0.0000697 -0.0483379 0.0000663 -0.1858496 -0.0077461 -0.0131433 -0.0299464 0.065509 -0.0488261 -0.0745398 0.0592507 -0.1107204 0.0514403 -0.0077417 0.0130895 -0.029902 -0.0655532 -0.0488796 0.0745227 0.0593053 0.1106479 0.0515333 -0.0249862 0.0000452 -0.0811235 0.000086 0.1130419 0.0000615 -0.1517628 0.0000771 -0.0356693 unknown
polarizability: 118.2187514|-0.0041139|77.8629977|5.4136165|0.0023231|83.5869741 unknown
InChI: InChI=1S/C7H14N2O/c1-8-9(10)7-5-3-2-4-6-7/h7H,2-6H2,1H3
charge 0 multiplicity 1
24 atoms
O  -1.624484 0.000013 1.415792
N  -1.405188 -0.000393 0.115805
N  -2.3208 0.000089 -0.83143
C  0.036947 -0.000106 -0.356731
C  0.742122 1.277852 0.149533
C  0.742334 -1.278266 0.148706
C  2.229946 1.275213 -0.277824
C  2.230151 -1.275097 -0.278669
C  2.957528 -0.000045 0.210317
C  -3.698942 0.000401 -0.282672
H  -0.027249 0.000247 -1.459093
H  0.661415 1.306233 1.252584
H  0.226719 2.172815 -0.246975
H  0.227078 -2.173061 -0.248375
H  0.661639 -1.307375 1.251738
H  2.727574 2.179355 0.121245
H  2.298394 1.334768 -1.383696
H  2.298597 -1.3339 -1.38458
H  2.727929 -2.179423 0.119793
H  4.006205 0.000158 -0.143604
H  2.990586 -0.00041 1.31895
H  -3.879078 0.886965 0.357706
H  -3.879625 -0.886344 0.357304
H  -4.386399 0.000811 -1.140625
