program: Gaussian 09
title: 000297309
version: EM64L-G09RevD.01
frameworkgroup: C1[X(C9H12ClF6O3P)]
method: RPBEPBE
basis: SDD
operation: Freq
keyword: #p
keyword: freq=noraman
keyword: PBEPBE/SDD
title: #p freq=noraman PBEPBE/SDD
converged: YES YES NO NO
title: Mulliken charges:
elementType: Cl P F F F F F F O O O C C C C C C C C C H H H H H H H H H H H H
charge: -0.147431 1.157241 -0.139511 -0.113561 -0.146273 -0.147841 -0.109021 -0.136846 -0.507392 -0.470332 -0.493789 -0.006161 0.297326 -0.651521 0.092794 -0.733355 -0.737050 -0.714121 0.386554 0.377116 0.278769 0.324536 0.306030 0.215861 0.234136 0.223033 0.245224 0.210808 0.222539 0.209547 0.217264 0.255426
chargesum: 0.00000
title: Mulliken charges with hydrogens summed into heavy atoms:
elementType: Cl P F F F F F F O O O C C C C C C C C C
charge: -0.147431 1.157241 -0.139511 -0.113561 -0.146273 -0.147841 -0.109021 -0.136846 -0.507392 -0.470332 -0.493789 0.272608 0.297326 -0.020955 0.092794 -0.060325 -0.058479 -0.031884 0.386554 0.377116
polarizability: 1.41711739e+02 -2.35778944e+00 1.50772240e+02 -3.63224155e+00 2.62108084e+00 1.34323754e+02
1716.lowfreq: -17.8227 -9.8624 -0.0014 -0.0008 0.0018 7.5869 31.4315 42.8611 43.9981
frequency: 31.3812 42.8438 43.9341 54.9484 62.1687 83.5494 113.6244 118.4429 136.0180 161.1183 177.1516 189.5362 212.8066 220.6524 227.1820 236.1359 248.0765 259.2227 267.2093 270.6239 285.4211 299.0064 304.0510 316.0101 329.4689 354.6388 375.6541 403.6581 422.7153 439.4773 458.8163 460.7362 487.6500 493.3109 509.8369 545.0610 611.4698 632.7049 660.6825 687.2249 718.4418 761.2634 819.5760 853.9545 897.8761 926.1237 930.3582 942.2288 947.4777 989.6793 1002.6215 1020.9757 1027.7866 1042.5181 1058.1665 1069.2156 1091.7254 1097.1860 1116.5082 1155.0721 1181.7704 1202.9750 1220.8489 1252.3101 1268.1977 1295.6919 1321.0364 1373.1218 1379.7937 1383.5880 1409.0069 1446.1523 1457.5384 1464.2496 1468.7518 1482.1434 1486.6018 1497.9799 2974.9581 2982.0019 2985.8985 3031.6260 3040.9069 3067.8597 3073.4572 3075.7818 3081.4582 3094.4781 3103.1023 3106.2835
redmass: 6.6370 9.5954 5.0261 11.9952 5.8931 9.3340 7.5336 7.6621 11.1693 4.7726 1.2224 7.2731 2.9627 2.0870 1.8396 5.6683 2.0091 3.1183 10.6281 7.9350 6.6897 4.8247 6.8818 4.4406 3.8161 4.3026 2.6576 6.5482 10.5896 4.1414 5.8863 13.5008 7.9803 5.1757 13.5987 3.1619 9.2331 10.0229 7.4366 6.7721 9.4942 3.8763 4.8349 4.5396 3.9895 1.8436 1.8495 1.9697 1.2693 11.2819 1.9383 1.6640 3.8369 2.9490 7.0684 8.2355 8.0345 9.0790 4.2902 4.1341 4.6964 2.3283 3.0015 2.3345 1.8489 1.2733 1.4609 1.3203 1.1910 1.2301 1.2066 1.0783 1.0489 1.0468 1.0482 1.0575 1.0517 1.0646 1.0360 1.0365 1.0373 1.0752 1.0707 1.1000 1.0988 1.0986 1.0977 1.0999 1.0992 1.1016
irintensity: 0.2079 0.0428 0.1072 0.2958 0.0855 0.0237 0.1076 0.4674 1.4187 2.2417 0.8373 8.2569 3.1033 0.1588 0.5247 1.7411 1.5198 0.8338 3.8126 2.1785 7.4387 1.0165 0.5276 2.7492 0.9961 6.6635 3.9085 0.4404 97.5964 19.5814 11.4142 3.0879 7.3733 4.3574 28.6457 15.6369 24.3172 19.7564 31.5677 26.3649 70.6832 6.1755 127.6391 57.9891 82.4796 3.8451 12.5018 55.6938 7.0933 31.3767 27.6843 24.8174 33.8708 303.4404 201.5502 61.3580 199.9566 68.0293 21.7149 115.7970 264.9778 42.4385 8.6387 5.9321 5.5913 7.1012 7.0794 8.1946 25.3089 26.4248 16.4093 21.4273 1.1327 0.8735 0.7953 10.3129 13.6427 34.7522 21.2263 32.2464 7.9286 2.7965 1.7656 10.2416 33.5791 13.0526 62.1541 12.5720 26.2689 0.0662
temp: 298.150 k
press: 1.00000 atm
elementType: 17 15 9 9 9 9 9 9 8 8 8 6 6 6 6 6 6 6 6 6 1 1 1 1 1 1 1 1 1 1 1 1
symmnumber: 1
zpe: 555740.4 jmol-1
zpe.correction: 0.211670 hartree
zpe.thermalcorrener: 0.233944 hartree
zpe.thermalcorrenthalpy: 0.234888 hartree
zpe.thermalcorrgfe: 0.160251 hartree
zpe.sumelectzpe: -1974.579745 hartree
zpe.sumelectthermal: -1974.557471 hartree
zpe.sumelectthermalent: -1974.556527 hartree
zpe.sumelectthermalfe: -1974.631164 hartree
dipole: 3.4406 -4.7839 -2.6401
dipole: 6.4571
quadrupole: -131.8623 -139.1303 -138.2990
quadrupole: -7.0605 -3.1549 -3.4815
quadrupole: 4.5683 -2.6998 -1.8685 -7.0605 -3.1549 -3.4815
hfenergy: -1974.7914153 hartree
pointgroup: C01 [X(C9H12Cl1F6O3P1)]
dipole: 1.5339014 2.0239917 -0.065191 debye
polarizability: 142.1107191|5.126434|147.198233|1.5926909|-6.4138929|137.4987806 unknown
InChI: InChI=1S/C9H12F6O3P.Cl/c1-6(2,3)5-4-7(8(10,11)12,9(13,14)15)18-19(16)17-5;/h5H,4H2,1-3H3;
charge 0 multiplicity 1
32 atoms
Cl 0.676761 -1.982061 2.708783
P  0.459162 -2.199621 0.460682
F  -0.618683 -0.49678 -2.360169
F  -2.741662 0.084043 -1.854696
F  -1.131483 1.672474 -1.947341
F  -2.460272 2.017768 0.593938
F  -3.395978 -0.046645 0.760511
F  -1.818724 0.589297 2.23926
O  1.686251 -1.203061 -0.172793
O  -1.043873 -1.32948 0.171478
O  0.420764 -3.685431 -0.041349
C  1.516156 0.292626 -0.403912
C  2.864526 0.969692 -0.024441
C  0.279523 0.814239 0.351472
C  -1.053024 0.118649 -0.031471
C  2.778167 2.469777 -0.428959
C  3.180455 0.838565 1.485967
C  3.983919 0.286617 -0.857347
C  -1.406857 0.343852 -1.54732
C  -2.202389 0.655593 0.886372
H  1.383695 0.371445 -1.498345
H  0.423803 0.675186 1.436388
H  0.174368 1.893441 0.157966
H  2.083402 3.042073 0.212743
H  3.77561 2.931851 -0.321916
H  2.465475 2.5954 -1.483083
H  3.184747 -0.21837 1.803671
H  2.460155 1.390522 2.117729
H  4.181321 1.259282 1.689274
H  3.79815 0.392903 -1.943006
H  4.957785 0.756674 -0.631466
H  4.052449 -0.789219 -0.626421
