program: Gaussian 09
title: 000297299
version: EM64L-G09RevD.01
frameworkgroup: C1[X(C8H15ClN2O)]
method: RPBEPBE
basis: SDD
operation: Freq
keyword: #p
keyword: freq=noraman
keyword: PBEPBE/SDD
title: #p freq=noraman PBEPBE/SDD
converged: YES YES NO NO
title: Mulliken charges:
elementType: Cl O N N C C C C C C C C H H H H H H H H H H H H H H H
charge: -0.090398 -0.332053 -0.404782 -0.403379 -0.116815 -0.502287 -0.507662 -0.056391 -0.721166 0.321711 -0.333508 -0.547883 0.225667 0.228079 0.263516 0.222655 0.236333 0.240256 0.231921 0.196325 0.230848 0.274236 0.292992 0.239428 0.267949 0.279796 0.264612
chargesum: 0.00000
title: Mulliken charges with hydrogens summed into heavy atoms:
elementType: Cl O N N C C C C C C C C
charge: -0.090398 -0.332053 -0.130546 -0.110386 0.108852 -0.010692 -0.048674 0.183865 -0.062072 0.321711 0.173868 -0.003475
polarizability: 1.40683788e+02 1.39723068e-01 1.05820079e+02 6.97805948e+00 -7.54349330e+00 8.86565662e+01
1716.lowfreq: -9.2943 0.0014 0.0020 0.0023 2.4954 6.9946 19.6122 37.0914 58.6947
frequency: 17.0794 37.0440 58.5587 64.1434 79.4682 107.2259 151.6976 197.9596 225.0184 228.4773 275.1026 305.6540 319.6585 362.6754 392.6690 449.9399 474.3660 535.8252 542.6574 592.6579 686.6666 709.0292 760.6933 806.7508 819.1625 843.4175 885.5555 914.0155 925.8473 968.6666 984.3787 990.8201 1038.5702 1043.8382 1068.8385 1095.5621 1101.6281 1116.8897 1153.3329 1165.9871 1186.6351 1191.2527 1205.2613 1221.5783 1242.2135 1288.5721 1297.3067 1321.1659 1368.9098 1380.6140 1393.9822 1437.6828 1439.9874 1443.7711 1454.9068 1469.4951 1472.8123 1476.6979 1504.7869 1620.3237 2974.1415 2991.4155 3028.7406 3049.7884 3063.0384 3069.2301 3085.4090 3089.6716 3095.3886 3101.9480 3152.5517 3188.0605 3208.6489 3537.4128 3549.4872
redmass: 5.3308 4.6672 5.8224 4.3399 3.4548 3.0535 3.9407 2.5031 1.3842 2.3651 2.3460 2.9880 1.5193 2.2540 2.8376 2.5409 2.8862 2.2002 1.6779 4.0598 4.1920 9.7849 1.3385 1.3791 1.3524 2.0109 2.2839 3.2875 2.8830 1.8668 2.1209 1.4365 1.2225 1.9253 1.2726 1.5452 1.8946 2.3468 1.5309 1.3971 2.1323 2.2005 1.6266 1.4072 1.5209 1.3361 1.1816 1.3782 1.3161 1.3094 1.4787 1.1413 1.1329 1.0902 1.3525 1.1538 1.2010 1.1050 2.3185 5.0058 1.0386 1.0594 1.0846 1.0958 1.0631 1.0954 1.0819 1.0542 1.1003 1.0674 1.1118 1.1169 1.1152 1.0772 1.0769
irintensity: 0.8313 0.2803 4.2622 8.3887 11.5030 4.8304 5.1437 0.3801 1.9209 5.6758 0.7615 2.6426 11.1964 24.0935 7.4753 3.7520 11.3526 95.0235 137.8751 36.3896 15.2865 10.2917 0.8937 6.2654 14.2202 14.9032 1.6384 0.8904 29.4697 14.1144 5.8678 11.7317 31.8657 1.8445 17.5739 7.7828 17.4529 36.1837 3.9340 0.6822 5.0625 57.1872 29.7727 20.1336 170.2679 3.6732 26.9951 67.9060 2.9404 22.8361 6.7705 22.1128 29.9956 5.1055 33.5613 4.4638 4.2138 11.8650 598.4367 154.4630 29.3297 51.5835 1.5615 6.6636 23.2281 26.0928 33.0086 17.2841 34.8722 11.8208 16.5931 5.7335 22.7542 11.0238 20.8862
temp: 298.150 k
press: 1.00000 atm
elementType: 17 8 7 7 6 6 6 6 6 6 6 6 1 1 1 1 1 1 1 1 1 1 1 1 1 1 1
symmnumber: 1
zpe: 592752.1 jmol-1
zpe.correction: 0.225767 hartree
zpe.thermalcorrener: 0.239923 hartree
zpe.thermalcorrenthalpy: 0.240867 hartree
zpe.thermalcorrgfe: 0.182257 hartree
zpe.sumelectzpe: -957.668518 hartree
zpe.sumelectthermal: -957.654362 hartree
zpe.sumelectthermalent: -957.653418 hartree
zpe.sumelectthermalfe: -957.712027 hartree
dipole: 0.6157 1.3414 -1.5740
dipole: 2.1578
quadrupole: -82.5129 -80.3877 -78.6881
quadrupole: 9.2959 -4.7521 0.0926
quadrupole: -1.9833 0.1419 1.8415 9.2959 -4.7521 0.0926
hfenergy: -957.894285 hartree
pointgroup: C01 [X(C8H15Cl1N2O1)]
dipole: -0.2692951 -0.2539594 -0.7639818 debye
polarizability: 139.8459008|4.4075615|98.0645139|-8.5603859|11.0574356|97.2500189 unknown
InChI: InChI=1S/C8H15ClN2O/c1-6(7-2-3-7)11-8(12)10-5-4-9/h6-7,10-11H,2-5H2,1H3
charge 0 multiplicity 1
27 atoms
Cl 4.834242 -0.392391 -0.938769
O  0.271459 0.64132 1.352767
N  -0.374965 -0.57432 -0.545467
N  1.745086 0.44356 -0.455994
C  -2.78519 0.087414 -0.56296
C  -2.880433 1.499904 0.026359
C  -3.9760 0.464342 0.334154
C  -1.72896 -0.887226 -0.034155
C  -2.090249 -2.350029 -0.367924
C  0.523666 0.196041 0.185298
C  2.804392 1.19114 0.216758
C  3.998659 0.323866 0.617264
H  -2.999136 -0.016238 -1.635733
H  -3.128559 2.327343 -0.645092
H  -2.174069 1.750733 0.823221
H  -4.005458 0.043924 1.345157
H  -4.959252 0.59108 -0.12828
H  -1.658419 -0.760538 1.061969
H  -3.09113 -2.592959 0.029552
H  -2.118589 -2.515055 -1.463277
H  -1.355841 -3.048743 0.069514
H  -0.160493 -0.835462 -1.509623
H  1.975654 -0.005749 -1.343829
H  3.150142 2.032555 -0.413108
H  2.352603 1.608789 1.137425
H  3.701569 -0.551499 1.212233
H  4.786674 0.904699 1.119741
